geronimo-dev mailing list archives

Site index · List index
Message view « Date » · « Thread »
Top « Date » · « Thread »
From ga...@apache.org
Subject [BUILD] trunk: Failed for Revision: 816988
Date Sun, 20 Sep 2009 07:47:08 GMT
Geronimo Revision: 816988 built with tests included
 
See the full build-0300.log file at http://people.apache.org/builds/geronimo/server/binaries/trunk/20090920/build-0300.log
 
 
See the unit test reports at http://people.apache.org/builds/geronimo/server/binaries/trunk/20090920/unit-test-reports
 
      [jar] Building jar: /home/geronimo/geronimo/trunk/plugins/connector-1_6/geronimo-connector-builder-1_6/target/test-rar-15.rar
    [mkdir] Created dir: /home/geronimo/geronimo/trunk/plugins/connector-1_6/geronimo-connector-builder-1_6/target/test-rar-15-notx/META-INF
     [copy] Copying 2 files to /home/geronimo/geronimo/trunk/plugins/connector-1_6/geronimo-connector-builder-1_6/target/test-rar-15-notx/META-INF
      [jar] Building jar: /home/geronimo/geronimo/trunk/plugins/connector-1_6/geronimo-connector-builder-1_6/target/test-rar-15-notx.rar
    [mkdir] Created dir: /home/geronimo/geronimo/trunk/plugins/connector-1_6/geronimo-connector-builder-1_6/target/test-rar-15-localtx/META-INF
     [copy] Copying 2 files to /home/geronimo/geronimo/trunk/plugins/connector-1_6/geronimo-connector-builder-1_6/target/test-rar-15-localtx/META-INF
      [jar] Building jar: /home/geronimo/geronimo/trunk/plugins/connector-1_6/geronimo-connector-builder-1_6/target/test-rar-15-localtx.rar
      [jar] Building jar: /home/geronimo/geronimo/trunk/plugins/connector-1_6/geronimo-connector-builder-1_6/target/test-ear.ear
    [mkdir] Created dir: /home/geronimo/geronimo/trunk/plugins/connector-1_6/geronimo-connector-builder-1_6/target/test-rar-10-noger/META-INF
     [copy] Copying 1 file to /home/geronimo/geronimo/trunk/plugins/connector-1_6/geronimo-connector-builder-1_6/target/test-rar-10-noger/META-INF
      [jar] Building jar: /home/geronimo/geronimo/trunk/plugins/connector-1_6/geronimo-connector-builder-1_6/target/test-rar-10-noger.rar
    [mkdir] Created dir: /home/geronimo/geronimo/trunk/plugins/connector-1_6/geronimo-connector-builder-1_6/target/test-rar-15-noger/META-INF
     [copy] Copying 1 file to /home/geronimo/geronimo/trunk/plugins/connector-1_6/geronimo-connector-builder-1_6/target/test-rar-15-noger/META-INF
      [jar] Building jar: /home/geronimo/geronimo/trunk/plugins/connector-1_6/geronimo-connector-builder-1_6/target/test-rar-15-noger.rar
      [jar] Building jar: /home/geronimo/geronimo/trunk/plugins/connector-1_6/geronimo-connector-builder-1_6/target/test-ear-noger.ear
[INFO] Executed tasks
[INFO] [compiler:testCompile]
[INFO] Compiling 23 source files to /home/geronimo/geronimo/trunk/plugins/connector-1_6/geronimo-connector-builder-1_6/target/test-classes
[WARNING] /home/geronimo/geronimo/trunk/plugins/connector-1_6/geronimo-connector-builder-1_6/src/test/java/org/apache/geronimo/connector/deployment/ConnectorModuleBuilderTest.java:[185,72]
[deprecation] toURL() in java.io.File has been deprecated

[WARNING] /home/geronimo/geronimo/trunk/plugins/connector-1_6/geronimo-connector-builder-1_6/src/test/java/org/apache/geronimo/connector/deployment/ConnectorModuleBuilderTest.java:[207,78]
[deprecation] toURL() in java.io.File has been deprecated

[WARNING] /home/geronimo/geronimo/trunk/plugins/connector-1_6/geronimo-connector-builder-1_6/src/test/java/org/apache/geronimo/connector/deployment/ConnectorModuleBuilderTest.java:[229,78]
[deprecation] toURL() in java.io.File has been deprecated

[WARNING] /home/geronimo/geronimo/trunk/plugins/connector-1_6/geronimo-connector-builder-1_6/src/test/java/org/apache/geronimo/connector/deployment/ConnectorModuleBuilderTest.java:[317,65]
[deprecation] toURL() in java.io.File has been deprecated

[WARNING] /home/geronimo/geronimo/trunk/plugins/connector-1_6/geronimo-connector-builder-1_6/src/test/java/org/apache/geronimo/connector/deployment/MockRARDeployable.java:[67,22]
[deprecation] getModuleDTDVersion() in javax.enterprise.deploy.model.DeployableObject has
been deprecated

[WARNING] /home/geronimo/geronimo/trunk/plugins/connector-1_6/geronimo-connector-builder-1_6/src/test/java/org/apache/geronimo/connector/deployment/RAR_1_0DConfigBeanTest.java:[113,43]
[deprecation] toURL() in java.io.File has been deprecated

[INFO] [surefire:test]
[INFO] Surefire report directory: /home/geronimo/geronimo/trunk/plugins/connector-1_6/geronimo-connector-builder-1_6/target/surefire-reports

-------------------------------------------------------
 T E S T S
-------------------------------------------------------
Running org.apache.geronimo.connector.deployment.RAR_1_5DConfigBeanTest
Tests run: 1, Failures: 0, Errors: 0, Skipped: 0, Time elapsed: 0.042 sec
Running org.apache.geronimo.connector.deployment.ConnectorModuleBuilderTest
Tests run: 10, Failures: 0, Errors: 0, Skipped: 0, Time elapsed: 5.684 sec
Running org.apache.geronimo.connector.deployment.annotation.ResourceAnnotationTest
Tests run: 1, Failures: 0, Errors: 1, Skipped: 0, Time elapsed: 0.014 sec <<< FAILURE!
Running org.apache.geronimo.connector.deployment.RAR_1_0DConfigBeanTest
Tests run: 1, Failures: 0, Errors: 0, Skipped: 0, Time elapsed: 0.008 sec
Running org.apache.geronimo.connector.deployment.MessageDestinationTest
Tests run: 3, Failures: 0, Errors: 0, Skipped: 0, Time elapsed: 0.075 sec
Running org.apache.geronimo.connector.deployment.PlanParsingTest
Tests run: 7, Failures: 0, Errors: 0, Skipped: 0, Time elapsed: 0.133 sec
Running org.apache.geronimo.connector.deployment.annotation.AnnotationHelperTest
Tests run: 1, Failures: 0, Errors: 0, Skipped: 0, Time elapsed: 0.14 sec
Running org.apache.geronimo.connector.deployment.SchemaConversionTest
Tests run: 1, Failures: 0, Errors: 0, Skipped: 0, Time elapsed: 0.026 sec

Results :

Tests in error: 
  initializationError(org.apache.geronimo.connector.deployment.annotation.ResourceAnnotationTest)

Tests run: 25, Failures: 0, Errors: 1, Skipped: 0

[INFO] ------------------------------------------------------------------------
[ERROR] BUILD FAILURE
[INFO] ------------------------------------------------------------------------
[INFO] There are test failures.

Please refer to /home/geronimo/geronimo/trunk/plugins/connector-1_6/geronimo-connector-builder-1_6/target/surefire-reports
for the individual test results.
[INFO] ------------------------------------------------------------------------
[INFO] Trace
org.apache.maven.BuildFailureException: There are test failures.

Please refer to /home/geronimo/geronimo/trunk/plugins/connector-1_6/geronimo-connector-builder-1_6/target/surefire-reports
for the individual test results.
	at org.apache.maven.lifecycle.DefaultLifecycleExecutor.executeGoals(DefaultLifecycleExecutor.java:580)
	at org.apache.maven.lifecycle.DefaultLifecycleExecutor.executeGoalWithLifecycle(DefaultLifecycleExecutor.java:500)
	at org.apache.maven.lifecycle.DefaultLifecycleExecutor.executeGoal(DefaultLifecycleExecutor.java:479)
	at org.apache.maven.lifecycle.DefaultLifecycleExecutor.executeGoalAndHandleFailures(DefaultLifecycleExecutor.java:331)
	at org.apache.maven.lifecycle.DefaultLifecycleExecutor.executeTaskSegments(DefaultLifecycleExecutor.java:292)
	at org.apache.maven.lifecycle.DefaultLifecycleExecutor.execute(DefaultLifecycleExecutor.java:142)
	at org.apache.maven.DefaultMaven.doExecute(DefaultMaven.java:336)
	at org.apache.maven.DefaultMaven.execute(DefaultMaven.java:129)
	at org.apache.maven.cli.MavenCli.main(MavenCli.java:301)
	at sun.reflect.NativeMethodAccessorImpl.invoke0(Native Method)
	at sun.reflect.NativeMethodAccessorImpl.invoke(NativeMethodAccessorImpl.java:39)
	at sun.reflect.DelegatingMethodAccessorImpl.invoke(DelegatingMethodAccessorImpl.java:25)
	at java.lang.reflect.Method.invoke(Method.java:597)
	at org.codehaus.classworlds.Launcher.launchEnhanced(Launcher.java:315)
	at org.codehaus.classworlds.Launcher.launch(Launcher.java:255)
	at org.codehaus.classworlds.Launcher.mainWithExitCode(Launcher.java:430)
	at org.codehaus.classworlds.Launcher.main(Launcher.java:375)
Caused by: org.apache.maven.plugin.MojoFailureException: There are test failures.

Please refer to /home/geronimo/geronimo/trunk/plugins/connector-1_6/geronimo-connector-builder-1_6/target/surefire-reports
for the individual test results.
	at org.apache.maven.plugin.surefire.SurefirePlugin.execute(SurefirePlugin.java:575)
	at org.apache.maven.plugin.DefaultPluginManager.executeMojo(DefaultPluginManager.java:453)
	at org.apache.maven.lifecycle.DefaultLifecycleExecutor.executeGoals(DefaultLifecycleExecutor.java:559)
	... 16 more
[INFO] ------------------------------------------------------------------------
[INFO] Total time: 40 minutes 55 seconds
[INFO] Finished at: Sun Sep 20 03:42:58 EDT 2009
[INFO] Final Memory: 318M/587M
[INFO] ------------------------------------------------------------------------

Mime
View raw message