geronimo-dev mailing list archives

Site index · List index
Message view « Date » · « Thread »
Top « Date » · « Thread »
From ga...@apache.org
Subject [BUILD] trunk: Failed for Revision: 814456
Date Mon, 14 Sep 2009 01:29:01 GMT
Geronimo Revision: 814456 built with tests included
 
See the full build-2100.log file at http://people.apache.org/builds/geronimo/server/binaries/trunk/20090913/build-2100.log
 
 
See the unit test reports at http://people.apache.org/builds/geronimo/server/binaries/trunk/20090913/unit-test-reports
 
[WARNING] Component returned which is not the same manager. Ignored. component=org.apache.maven.profiles.activation.AlwaysOnProfileActivator@4140414
[WARNING] Component returned which is not the same manager. Ignored. component=org.apache.maven.profiles.activation.SystemPropertyProfileActivator@4140414
[WARNING] Component returned which is not the same manager. Ignored. component=org.apache.maven.profiles.activation.AlwaysOnProfileActivator@4140414
[WARNING] Component returned which is not the same manager. Ignored. component=org.apache.maven.profiles.activation.SystemPropertyProfileActivator@4140414
[WARNING] Component returned which is not the same manager. Ignored. component=org.apache.maven.profiles.activation.AlwaysOnProfileActivator@4140414
[WARNING] Component returned which is not the same manager. Ignored. component=org.apache.maven.profiles.activation.SystemPropertyProfileActivator@4140414
[WARNING] Component returned which is not the same manager. Ignored. component=org.apache.maven.profiles.activation.AlwaysOnProfileActivator@4140414
[WARNING] Component returned which is not the same manager. Ignored. component=org.apache.maven.profiles.activation.SystemPropertyProfileActivator@4140414
[WARNING] Component returned which is not the same manager. Ignored. component=org.apache.maven.profiles.activation.AlwaysOnProfileActivator@4140414
[WARNING] Component returned which is not the same manager. Ignored. component=org.apache.maven.profiles.activation.SystemPropertyProfileActivator@4140414
[WARNING] Component returned which is not the same manager. Ignored. component=org.apache.maven.profiles.activation.AlwaysOnProfileActivator@4140414
[WARNING] Component returned which is not the same manager. Ignored. component=org.apache.maven.profiles.activation.SystemPropertyProfileActivator@4140414
[WARNING] Component returned which is not the same manager. Ignored. component=org.apache.maven.profiles.activation.AlwaysOnProfileActivator@4140414
[WARNING] Component returned which is not the same manager. Ignored. component=org.apache.maven.profiles.activation.SystemPropertyProfileActivator@4140414
[WARNING] Component returned which is not the same manager. Ignored. component=org.apache.maven.profiles.activation.AlwaysOnProfileActivator@4140414
[WARNING] Component returned which is not the same manager. Ignored. component=org.apache.maven.profiles.activation.SystemPropertyProfileActivator@4140414
[WARNING] Component returned which is not the same manager. Ignored. component=org.apache.maven.profiles.activation.AlwaysOnProfileActivator@4140414
[WARNING] Component returned which is not the same manager. Ignored. component=org.apache.maven.profiles.activation.SystemPropertyProfileActivator@4140414
[WARNING] Component returned which is not the same manager. Ignored. component=org.apache.maven.profiles.activation.AlwaysOnProfileActivator@4140414
[WARNING] Component returned which is not the same manager. Ignored. component=org.apache.maven.profiles.activation.SystemPropertyProfileActivator@4140414
[WARNING] Component returned which is not the same manager. Ignored. component=org.apache.maven.profiles.activation.AlwaysOnProfileActivator@4140414
[WARNING] Component returned which is not the same manager. Ignored. component=org.apache.maven.profiles.activation.SystemPropertyProfileActivator@4140414
[WARNING] Component returned which is not the same manager. Ignored. component=org.apache.maven.profiles.activation.AlwaysOnProfileActivator@4140414
[WARNING] Component returned which is not the same manager. Ignored. component=org.apache.maven.profiles.activation.SystemPropertyProfileActivator@4140414
[WARNING] Component returned which is not the same manager. Ignored. component=org.apache.maven.profiles.activation.AlwaysOnProfileActivator@4140414
[WARNING] Component returned which is not the same manager. Ignored. component=org.apache.maven.profiles.activation.SystemPropertyProfileActivator@4140414
[WARNING] Component returned which is not the same manager. Ignored. component=org.apache.maven.profiles.activation.AlwaysOnProfileActivator@4140414
[WARNING] Component returned which is not the same manager. Ignored. component=org.apache.maven.profiles.activation.SystemPropertyProfileActivator@4140414
[WARNING] Component returned which is not the same manager. Ignored. component=org.apache.maven.profiles.activation.AlwaysOnProfileActivator@4140414
[WARNING] Component returned which is not the same manager. Ignored. component=org.apache.maven.profiles.activation.SystemPropertyProfileActivator@4140414
[WARNING] Component returned which is not the same manager. Ignored. component=org.apache.maven.profiles.activation.AlwaysOnProfileActivator@4140414
[INFO] [surefire:test]
[WARNING] Component returned which is not the same manager. Ignored. component=org.apache.maven.profiles.activation.SystemPropertyProfileActivator@4140414
[WARNING] Component returned which is not the same manager. Ignored. component=org.apache.maven.profiles.activation.AlwaysOnProfileActivator@4140414
[INFO] Surefire report directory: /home/geronimo/geronimo/trunk/plugins/tomcat/geronimo-tomcat6/target/surefire-reports

-------------------------------------------------------
 T E S T S
-------------------------------------------------------
Running org.apache.geronimo.tomcat.StatTest
Tests run: 1, Failures: 0, Errors: 0, Skipped: 0, Time elapsed: 8.276 sec
Running org.apache.geronimo.tomcat.JACCSecurityTest
Tests run: 1, Failures: 0, Errors: 0, Skipped: 0, Time elapsed: 4.599 sec
Running org.apache.geronimo.tomcat.JAASSecurityTest
Tests run: 1, Failures: 0, Errors: 0, Skipped: 0, Time elapsed: 2.736 sec
Running org.apache.geronimo.tomcat.BasicTest
Tests run: 1, Failures: 0, Errors: 0, Skipped: 0, Time elapsed: 0.375 sec
Running org.apache.geronimo.tomcat.ApplicationTest
Tests run: 1, Failures: 0, Errors: 0, Skipped: 0, Time elapsed: 4.008 sec
Running org.apache.geronimo.tomcat.TomcatServerGBeanTest
Tests run: 2, Failures: 0, Errors: 2, Skipped: 0, Time elapsed: 4.581 sec <<< FAILURE!
Running org.apache.geronimo.tomcat.ContainerTest
Tests run: 1, Failures: 0, Errors: 0, Skipped: 0, Time elapsed: 3.932 sec

Results :

Tests in error: 

Tests run: 8, Failures: 0, Errors: 2, Skipped: 0

[INFO] ------------------------------------------------------------------------
[ERROR] BUILD FAILURE
[INFO] ------------------------------------------------------------------------
[INFO] There are test failures.

Please refer to /home/geronimo/geronimo/trunk/plugins/tomcat/geronimo-tomcat6/target/surefire-reports
for the individual test results.
[INFO] ------------------------------------------------------------------------
[INFO] Trace
org.apache.maven.BuildFailureException: There are test failures.

Please refer to /home/geronimo/geronimo/trunk/plugins/tomcat/geronimo-tomcat6/target/surefire-reports
for the individual test results.
	at org.apache.maven.lifecycle.DefaultLifecycleExecutor.executeGoals(DefaultLifecycleExecutor.java:580)
	at org.apache.maven.lifecycle.DefaultLifecycleExecutor.executeGoalWithLifecycle(DefaultLifecycleExecutor.java:500)
	at org.apache.maven.lifecycle.DefaultLifecycleExecutor.executeGoal(DefaultLifecycleExecutor.java:479)
	at org.apache.maven.lifecycle.DefaultLifecycleExecutor.executeGoalAndHandleFailures(DefaultLifecycleExecutor.java:331)
	at org.apache.maven.lifecycle.DefaultLifecycleExecutor.executeTaskSegments(DefaultLifecycleExecutor.java:292)
	at org.apache.maven.lifecycle.DefaultLifecycleExecutor.execute(DefaultLifecycleExecutor.java:142)
	at org.apache.maven.DefaultMaven.doExecute(DefaultMaven.java:336)
	at org.apache.maven.DefaultMaven.execute(DefaultMaven.java:129)
	at org.apache.maven.cli.MavenCli.main(MavenCli.java:301)
	at sun.reflect.NativeMethodAccessorImpl.invoke0(Native Method)
	at sun.reflect.NativeMethodAccessorImpl.invoke(NativeMethodAccessorImpl.java:39)
	at sun.reflect.DelegatingMethodAccessorImpl.invoke(DelegatingMethodAccessorImpl.java:37)
	at java.lang.reflect.Method.invoke(Method.java:599)
	at org.codehaus.classworlds.Launcher.launchEnhanced(Launcher.java:315)
	at org.codehaus.classworlds.Launcher.launch(Launcher.java:255)
	at org.codehaus.classworlds.Launcher.mainWithExitCode(Launcher.java:430)
	at org.codehaus.classworlds.Launcher.main(Launcher.java:375)
Caused by: org.apache.maven.plugin.MojoFailureException: There are test failures.

Please refer to /home/geronimo/geronimo/trunk/plugins/tomcat/geronimo-tomcat6/target/surefire-reports
for the individual test results.
	at org.apache.maven.plugin.surefire.SurefirePlugin.execute(SurefirePlugin.java:575)
	at org.apache.maven.plugin.DefaultPluginManager.executeMojo(DefaultPluginManager.java:453)
	at org.apache.maven.lifecycle.DefaultLifecycleExecutor.executeGoals(DefaultLifecycleExecutor.java:559)
	... 16 more
[INFO] ------------------------------------------------------------------------
[INFO] Total time: 22 minutes 4 seconds
[INFO] Finished at: Sun Sep 13 21:24:12 EDT 2009
[INFO] Final Memory: 728M/1024M
[INFO] ------------------------------------------------------------------------

Mime
View raw message