geronimo-dev mailing list archives

Site index · List index
Message view « Date » · « Thread »
Top « Date » · « Thread »
From Shawn Jiang <genspr...@gmail.com>
Subject Re: [BUILD] trunk: Failed for Revision: 803334
Date Wed, 12 Aug 2009 09:42:32 GMT
I'm pretty sure that this is caused by

http://svn.apache.org/viewvc/geronimo/server/trunk/pom.xml?view=diff&r1=803286&r2=803287&pathrev=803287

Seems maven does not support multiple activated profiles in pom at the same
time.  Need to figure out a better way to handle tool.jar path for IBM JDK
here.


On Wed, Aug 12, 2009 at 3:28 PM, Rex Wang <rwonly@gmail.com> wrote:

>
> Download the binaries from
> http://people.apache.org/builds/geronimo/server/binaries/trunk/20090811
> [INFO] BUILD SUCCESSFUL
> [INFO] ------------------------------
>>
>> ------------------------------------------
>> [INFO] *Total time: 1 minute 12 seconds*
>> [INFO] Finished at: Tue Aug 11 21:04:35 EDT 2009
>> [INFO] Final Memory: 26M/520M
>> [INFO]
>> ------------------------------------------------------------------------
>
>
> why did this build close so fast?
>
>
>
> 2009/8/12 <gawor@apache.org>
>
> Geronimo Revision: 803334 built with tests included
>>
>> See the full build-2100.log file at
>> http://people.apache.org/builds/geronimo/server/binaries/trunk/20090811/build-2100.log
>>
>> Download the binaries from
>> http://people.apache.org/builds/geronimo/server/binaries/trunk/20090811
>> [INFO] BUILD SUCCESSFUL
>> [INFO]
>> ------------------------------------------------------------------------
>> [INFO] Total time: 1 minute 12 seconds
>> [INFO] Finished at: Tue Aug 11 21:04:35 EDT 2009
>> [INFO] Final Memory: 26M/520M
>> [INFO]
>> ------------------------------------------------------------------------
>>
>> TESTSUITE RESULTS (Failures only)
>> =================================
>>
>> Assembly: tomcat
>> =================================
>> See full test results and logs at
>> http://people.apache.org/builds/geronimo/server/binaries/trunk/20090811/logs-2100-tomcat/
>>
>>
>> [INFO] Expanding:
>> /home/geronimo/.m2/repository/org/apache/geronimo/assemblies/geronimo-tomcat6-javaee5/2.2-SNAPSHOT/geronimo-tomcat6-javaee5-2.2-SNAPSHOT-bin.zip
>> into /home/geronimo/geronimo/trunk/testsuite/target
>> [INFO] Starting Geronimo server...
>> [INFO] Selected option set: default
>> [INFO] Redirecting output to:
>> /home/geronimo/geronimo/trunk/testsuite/target/geronimo-logs/org.apache.geronimo.mavenplugins.geronimo.server.StartServerMojo.log
>> [INFO] Waiting for Geronimo server...
>> [INFO] Geronimo server started in 0:00:41.733
>> [INFO] [shitty:install {execution: default}]
>> [INFO] Installing /home/geronimo/geronimo/trunk/testsuite/pom.xml to
>> /home/geronimo/.m2/repository/org/apache/geronimo/testsuite/testsuite/testing/testsuite-testing.pom
>> [INFO] [shitty:test {execution: default}]
>> [INFO] Starting 36 test builds
>> [INFO]
>> [INFO]
>> -------------------------------------------------------------------------------
>> [INFO]
>> [INFO] commands-testsuite/deploy                  RUNNING
>> [INFO] commands-testsuite/deploy                  SUCCESS (0:01:41.407)
>> [INFO] commands-testsuite/gshell                  RUNNING
>> [INFO] commands-testsuite/gshell                  SUCCESS (0:00:44.923)
>> [INFO] commands-testsuite/jaxws                   RUNNING
>> [INFO] commands-testsuite/jaxws                   SUCCESS (0:00:53.820)
>> [INFO] commands-testsuite/shutdown                RUNNING
>> [INFO] commands-testsuite/shutdown                SUCCESS (0:00:32.525)
>> [INFO] concurrent-testsuite/concurrent-basic      RUNNING
>> [INFO] concurrent-testsuite/concurrent-basic      SUCCESS (0:08:16.619)
>> [INFO] console-testsuite/advanced                 RUNNING
>> [INFO] console-testsuite/advanced                 FAILURE (0:01:33.406)
>> Java returned: 1
>> [INFO] console-testsuite/basic                    RUNNING
>> [INFO] console-testsuite/basic                    SUCCESS (0:02:06.313)
>> [INFO] corba-testsuite/corba-helloworld           RUNNING
>> [INFO] corba-testsuite/corba-helloworld           SUCCESS (0:01:16.687)
>> [INFO] corba-testsuite/corba-marshal              RUNNING
>> [INFO] corba-testsuite/corba-marshal              SUCCESS (0:01:13.908)
>> [INFO] corba-testsuite/corba-mytime               RUNNING
>> [INFO] corba-testsuite/corba-mytime               SUCCESS (0:01:06.134)
>> [INFO] deployment-testsuite/deployment-tests      RUNNING
>> [INFO] deployment-testsuite/deployment-tests      SUCCESS (0:00:43.626)
>> [INFO] deployment-testsuite/jca-cms-tests         RUNNING
>> [INFO] deployment-testsuite/jca-cms-tests         SUCCESS (0:00:51.167)
>> [INFO] deployment-testsuite/manifestcp-tests      RUNNING
>> [INFO] deployment-testsuite/manifestcp-tests      SUCCESS (0:01:07.537)
>> [INFO] enterprise-testsuite/ejb-tests             RUNNING
>> [INFO] enterprise-testsuite/ejb-tests             SUCCESS (0:03:10.773)
>> [INFO] enterprise-testsuite/jms-tests             RUNNING
>> [INFO] enterprise-testsuite/jms-tests             FAILURE (0:03:59.162)
>> Java returned: 1
>> [INFO] enterprise-testsuite/jpa-tests             RUNNING
>> [INFO] enterprise-testsuite/jpa-tests             SUCCESS (0:01:20.703)
>> [INFO] enterprise-testsuite/sec-client            RUNNING
>> [INFO] enterprise-testsuite/sec-client            SUCCESS (0:00:43.485)
>> [INFO] enterprise-testsuite/sec-tests             RUNNING
>> [INFO] enterprise-testsuite/sec-tests             FAILURE (0:01:29.166)
>> Java returned: 1
>> [INFO] security-testsuite/test-security           RUNNING
>> [INFO] security-testsuite/test-security           SUCCESS (0:01:06.933)
>> [INFO] web-testsuite/test-2.1-jsps                RUNNING
>> [INFO] web-testsuite/test-2.1-jsps                SUCCESS (0:00:41.064)
>> [INFO] web-testsuite/test-2.5-servlets            RUNNING
>> [INFO] web-testsuite/test-2.5-servlets            SUCCESS (0:00:39.877)
>> [INFO] web-testsuite/test-myfaces                 RUNNING
>> [INFO] web-testsuite/test-myfaces                 SUCCESS (0:00:42.701)
>> [INFO] web-testsuite/test-tomcat                  RUNNING
>> [INFO] web-testsuite/test-tomcat                  FAILURE (0:00:28.054)
>> Java returned: 1
>> [INFO] web-testsuite/test-web-forward             RUNNING
>> [INFO] web-testsuite/test-web-forward             SUCCESS (0:00:56.900)
>> [INFO] web-testsuite/test-web-references          RUNNING
>> [INFO] web-testsuite/test-web-references          SUCCESS (0:01:03.064)
>> [INFO] webservices-testsuite/jaxb-tests           RUNNING
>> [INFO] webservices-testsuite/jaxb-tests           SUCCESS (0:01:28.704)
>> [INFO] webservices-testsuite/jaxr-tests           RUNNING
>> [INFO] webservices-testsuite/jaxr-tests           SUCCESS (0:01:29.038)
>> [INFO] webservices-testsuite/jaxrpc-jaxws-tests   RUNNING
>> [INFO] webservices-testsuite/jaxrpc-jaxws-tests   SUCCESS (0:00:44.791)
>> [INFO] webservices-testsuite/jaxrpc-tests         RUNNING
>> [INFO] webservices-testsuite/jaxrpc-tests         SUCCESS (0:01:14.027)
>> [INFO] webservices-testsuite/jaxws-catalog-tests  RUNNING
>> [INFO] webservices-testsuite/jaxws-catalog-tests  SUCCESS (0:01:14.845)
>> [INFO] webservices-testsuite/jaxws-mtom-tests     RUNNING
>> [INFO] webservices-testsuite/jaxws-mtom-tests     SUCCESS (0:01:15.017)
>> [INFO] webservices-testsuite/jaxws-provider-tests RUNNING
>> [INFO] webservices-testsuite/jaxws-provider-tests SUCCESS (0:01:16.185)
>> [INFO] webservices-testsuite/jaxws-tests          RUNNING
>> [INFO] webservices-testsuite/jaxws-tests          FAILURE (0:02:13.020)
>> Java returned: 1
>> [INFO] webservices-testsuite/jaxws-wsa-tests      RUNNING
>> [INFO] webservices-testsuite/jaxws-wsa-tests      SUCCESS (0:01:17.149)
>> [INFO] webservices-testsuite/saaj-tests           RUNNING
>> [INFO] webservices-testsuite/saaj-tests           SUCCESS (0:00:54.276)
>> [INFO] webservices-testsuite/stax-tests           RUNNING
>> [INFO] webservices-testsuite/stax-tests           SUCCESS (0:01:28.748)
>> [INFO]
>> [INFO]
>> -------------------------------------------------------------------------------
>> [INFO] Test Summary (0:53:05.963)
>> [INFO]     Passed: 31
>> [INFO]     Failed: 5
>> [INFO]
>> -------------------------------------------------------------------------------
>> [INFO]
>> [INFO] The following tests failed:
>> [INFO]     * console-testsuite/advanced -
>> /home/geronimo/geronimo/trunk/testsuite/console-testsuite/advanced/build.log
>> [INFO]     * enterprise-testsuite/jms-tests -
>> /home/geronimo/geronimo/trunk/testsuite/enterprise-testsuite/jms-tests/build.log
>> [INFO]     * enterprise-testsuite/sec-tests -
>> /home/geronimo/geronimo/trunk/testsuite/enterprise-testsuite/sec-tests/build.log
>> [INFO]     * web-testsuite/test-tomcat -
>> /home/geronimo/geronimo/trunk/testsuite/web-testsuite/test-tomcat/build.log
>> [INFO]     * webservices-testsuite/jaxws-tests -
>> /home/geronimo/geronimo/trunk/testsuite/webservices-testsuite/jaxws-tests/build.log
>> [INFO]
>> [INFO]
>> ------------------------------------------------------------------------
>> [ERROR] BUILD ERROR
>>
>> Assembly: jetty
>> =================================
>> See full test results and logs at
>> http://people.apache.org/builds/geronimo/server/binaries/trunk/20090811/logs-2100-jetty/
>>
>>
>> [INFO] Expanding:
>> /home/geronimo/.m2/repository/org/apache/geronimo/assemblies/geronimo-jetty7-javaee5/2.2-SNAPSHOT/geronimo-jetty7-javaee5-2.2-SNAPSHOT-bin.zip
>> into /home/geronimo/geronimo/trunk/testsuite/target
>> [INFO] Starting Geronimo server...
>> [INFO] Selected option set: default
>> [INFO] Redirecting output to:
>> /home/geronimo/geronimo/trunk/testsuite/target/geronimo-logs/org.apache.geronimo.mavenplugins.geronimo.server.StartServerMojo.log
>> [INFO] Waiting for Geronimo server...
>> [INFO] Geronimo server started in 0:00:43.439
>> [INFO] [shitty:install {execution: default}]
>> [INFO] Installing /home/geronimo/geronimo/trunk/testsuite/pom.xml to
>> /home/geronimo/.m2/repository/org/apache/geronimo/testsuite/testsuite/testing/testsuite-testing.pom
>> [INFO] [shitty:test {execution: default}]
>> [INFO] Starting 36 test builds
>> [INFO]
>> [INFO]
>> -------------------------------------------------------------------------------
>> [INFO]
>> [INFO] commands-testsuite/deploy                  RUNNING
>> [INFO] commands-testsuite/deploy                  SUCCESS (0:01:14.233)
>> [INFO] commands-testsuite/gshell                  RUNNING
>> [INFO] commands-testsuite/gshell                  SUCCESS (0:00:45.059)
>> [INFO] commands-testsuite/jaxws                   RUNNING
>> [INFO] commands-testsuite/jaxws                   SUCCESS (0:00:47.915)
>> [INFO] commands-testsuite/shutdown                RUNNING
>> [INFO] commands-testsuite/shutdown                SUCCESS (0:00:32.636)
>> [INFO] concurrent-testsuite/concurrent-basic      RUNNING
>> [INFO] concurrent-testsuite/concurrent-basic      SUCCESS (0:07:18.420)
>> [INFO] console-testsuite/advanced                 RUNNING
>> [INFO] console-testsuite/advanced                 FAILURE (0:00:26.322)
>> Java returned: 1
>> [INFO] console-testsuite/basic                    RUNNING
>> [INFO] console-testsuite/basic                    SUCCESS (0:02:12.111)
>> [INFO] corba-testsuite/corba-helloworld           RUNNING
>> [INFO] corba-testsuite/corba-helloworld           SUCCESS (0:01:15.764)
>> [INFO] corba-testsuite/corba-marshal              RUNNING
>> [INFO] corba-testsuite/corba-marshal              SUCCESS (0:01:01.899)
>> [INFO] corba-testsuite/corba-mytime               RUNNING
>> [INFO] corba-testsuite/corba-mytime               SUCCESS (0:01:05.037)
>> [INFO] deployment-testsuite/deployment-tests      RUNNING
>> [INFO] deployment-testsuite/deployment-tests      SUCCESS (0:00:41.873)
>> [INFO] deployment-testsuite/jca-cms-tests         RUNNING
>> [INFO] deployment-testsuite/jca-cms-tests         SUCCESS (0:00:48.694)
>> [INFO] deployment-testsuite/manifestcp-tests      RUNNING
>> [INFO] deployment-testsuite/manifestcp-tests      SUCCESS (0:01:07.180)
>> [INFO] enterprise-testsuite/ejb-tests             RUNNING
>> [INFO] enterprise-testsuite/ejb-tests             SUCCESS (0:01:11.428)
>> [INFO] enterprise-testsuite/jms-tests             RUNNING
>> [INFO] enterprise-testsuite/jms-tests             FAILURE (0:03:58.583)
>> Java returned: 1
>> [INFO] enterprise-testsuite/jpa-tests             RUNNING
>> [INFO] enterprise-testsuite/jpa-tests             SUCCESS (0:01:10.486)
>> [INFO] enterprise-testsuite/sec-client            RUNNING
>> [INFO] enterprise-testsuite/sec-client            SUCCESS (0:00:42.937)
>> [INFO] enterprise-testsuite/sec-tests             RUNNING
>> [INFO] enterprise-testsuite/sec-tests             FAILURE (0:01:26.871)
>> Java returned: 1
>> [INFO] security-testsuite/test-security           RUNNING
>> [INFO] security-testsuite/test-security           FAILURE (0:01:00.622)
>> Java returned: 1
>> [INFO] web-testsuite/test-2.1-jsps                RUNNING
>> [INFO] web-testsuite/test-2.1-jsps                SUCCESS (0:00:41.534)
>> [INFO] web-testsuite/test-2.5-servlets            RUNNING
>> [INFO] web-testsuite/test-2.5-servlets            SUCCESS (0:00:40.465)
>> [INFO] web-testsuite/test-jetty                   RUNNING
>> [INFO] web-testsuite/test-jetty                   SUCCESS (0:00:33.240)
>> [INFO] web-testsuite/test-myfaces                 RUNNING
>> [INFO] web-testsuite/test-myfaces                 SUCCESS (0:00:43.022)
>> [INFO] web-testsuite/test-web-forward             RUNNING
>> [INFO] web-testsuite/test-web-forward             SUCCESS (0:00:57.348)
>> [INFO] web-testsuite/test-web-references          RUNNING
>> [INFO] web-testsuite/test-web-references          SUCCESS (0:01:03.778)
>> [INFO] webservices-testsuite/jaxb-tests           RUNNING
>> [INFO] webservices-testsuite/jaxb-tests           SUCCESS (0:01:30.683)
>> [INFO] webservices-testsuite/jaxr-tests           RUNNING
>> [INFO] webservices-testsuite/jaxr-tests           SUCCESS (0:01:29.122)
>> [INFO] webservices-testsuite/jaxrpc-jaxws-tests   RUNNING
>> [INFO] webservices-testsuite/jaxrpc-jaxws-tests   SUCCESS (0:00:41.050)
>> [INFO] webservices-testsuite/jaxrpc-tests         RUNNING
>> [INFO] webservices-testsuite/jaxrpc-tests         SUCCESS (0:01:12.924)
>> [INFO] webservices-testsuite/jaxws-catalog-tests  RUNNING
>> [INFO] webservices-testsuite/jaxws-catalog-tests  SUCCESS (0:01:15.150)
>> [INFO] webservices-testsuite/jaxws-mtom-tests     RUNNING
>> [INFO] webservices-testsuite/jaxws-mtom-tests     SUCCESS (0:01:08.439)
>> [INFO] webservices-testsuite/jaxws-provider-tests RUNNING
>> [INFO] webservices-testsuite/jaxws-provider-tests SUCCESS (0:01:17.578)
>> [INFO] webservices-testsuite/jaxws-tests          RUNNING
>> [INFO] webservices-testsuite/jaxws-tests          FAILURE (0:02:08.138)
>> Java returned: 1
>> [INFO] webservices-testsuite/jaxws-wsa-tests      RUNNING
>> [INFO] webservices-testsuite/jaxws-wsa-tests      SUCCESS (0:01:10.204)
>> [INFO] webservices-testsuite/saaj-tests           RUNNING
>> [INFO] webservices-testsuite/saaj-tests           SUCCESS (0:00:54.441)
>> [INFO] webservices-testsuite/stax-tests           RUNNING
>> [INFO] webservices-testsuite/stax-tests           SUCCESS (0:01:30.265)
>> [INFO]
>> [INFO]
>> -------------------------------------------------------------------------------
>> [INFO] Test Summary (0:47:45.639)
>> [INFO]     Passed: 31
>> [INFO]     Failed: 5
>> [INFO]
>> -------------------------------------------------------------------------------
>> [INFO]
>> [INFO] The following tests failed:
>> [INFO]     * console-testsuite/advanced -
>> /home/geronimo/geronimo/trunk/testsuite/console-testsuite/advanced/build.log
>> [INFO]     * enterprise-testsuite/jms-tests -
>> /home/geronimo/geronimo/trunk/testsuite/enterprise-testsuite/jms-tests/build.log
>> [INFO]     * enterprise-testsuite/sec-tests -
>> /home/geronimo/geronimo/trunk/testsuite/enterprise-testsuite/sec-tests/build.log
>> [INFO]     * security-testsuite/test-security -
>> /home/geronimo/geronimo/trunk/testsuite/security-testsuite/test-security/build.log
>> [INFO]     * webservices-testsuite/jaxws-tests -
>> /home/geronimo/geronimo/trunk/testsuite/webservices-testsuite/jaxws-tests/build.log
>> [INFO]
>> [INFO]
>> ------------------------------------------------------------------------
>> [ERROR] BUILD ERROR
>>
>> Samples: trunk
>> =================================
>> Log:
>> http://people.apache.org/builds/geronimo/server/binaries/trunk/20090811/samples-2100.log
>>
>> Build status: FAILED
>>
>>
>


-- 
Shawn

Mime
View raw message