geronimo-dev mailing list archives

Site index · List index
Message view « Date » · « Thread »
Top « Date » · « Thread »
From David Jencks <david_jen...@yahoo.com>
Subject Re: [BUILD] trunk: Failed for Revision: 804178
Date Sat, 15 Aug 2009 22:11:39 GMT
I think I fixed this in rev 804534.

thanks for figuring out where the problem is!
david jencks

On Aug 14, 2009, at 11:21 AM, Ivan wrote:

> The failed console-advanced case is caused by
> IlegalArgumentException "About the  
> IllegalArgumentException"Qualifier patterns must not be present when  
> first URLPattern is an exact pattern"
>
> I found a JIRA 2709 and checked the codes in the Jetty's  
> securityHandler, I found some codes of replace %3A and : are removed,
> So do we need recover those codes ? Or for some reasons, we do not  
> need them. Thanks for any comment !
>
>
>
> 2009/8/14 <gawor@apache.org>
> Geronimo Revision: 804178 built with tests included
>
> See the full build-0900.log file at http://people.apache.org/builds/geronimo/server/binaries/trunk/20090814/build-0900.log
>
> Download the binaries from http://people.apache.org/builds/geronimo/server/binaries/trunk/20090814
> [INFO] BUILD SUCCESSFUL
> [INFO]  
> ------------------------------------------------------------------------
> [INFO] Total time: 43 minutes 54 seconds
> [INFO] Finished at: Fri Aug 14 09:47:18 EDT 2009
> [INFO] Final Memory: 402M/1003M
> [INFO]  
> ------------------------------------------------------------------------
>
> TESTSUITE RESULTS (Failures only)
> =================================
>
> Assembly: tomcat
> =================================
> See full test results and logs at http://people.apache.org/builds/geronimo/server/binaries/trunk/20090814/logs-0900-tomcat/
>
>
> [INFO] Using assembly artifact:  
> org.apache.geronimo.assemblies:geronimo-tomcat6-javaee5:zip:bin:2.2- 
> SNAPSHOT:provided
> [INFO] Using geronimoHome: /home/geronimo/geronimo/trunk/testsuite/ 
> target/geronimo-tomcat6-javaee5-2.2-SNAPSHOT
> [INFO] Installing assembly...
> [INFO] Expanding: /home/geronimo/.m2/repository/org/apache/geronimo/ 
> assemblies/geronimo-tomcat6-javaee5/2.2-SNAPSHOT/geronimo-tomcat6- 
> javaee5-2.2-SNAPSHOT-bin.zip into /home/geronimo/geronimo/trunk/ 
> testsuite/target
> [INFO] Starting Geronimo server...
> [INFO] Selected option set: default
> [INFO] Redirecting output to: /home/geronimo/geronimo/trunk/ 
> testsuite/target/geronimo-logs/ 
> org.apache.geronimo.mavenplugins.geronimo.server.StartServerMojo.log
> [INFO] Waiting for Geronimo server...
> [INFO] Geronimo server started in 0:00:45.477
> [INFO] [shitty:install {execution: default}]
> [INFO] Installing /home/geronimo/geronimo/trunk/testsuite/pom.xml  
> to /home/geronimo/.m2/repository/org/apache/geronimo/testsuite/ 
> testsuite/testing/testsuite-testing.pom
> [INFO] [shitty:test {execution: default}]
> [INFO] Starting 36 test builds
> [INFO]
> [INFO]  
> -------------------------------------------------------------------------------
> [INFO]
> [INFO] commands-testsuite/deploy                  RUNNING
> [INFO] commands-testsuite/deploy                  SUCCESS  
> (0:01:15.516)
> [INFO] commands-testsuite/gshell                  RUNNING
> [INFO] commands-testsuite/gshell                  SUCCESS  
> (0:00:34.504)
> [INFO] commands-testsuite/jaxws                   RUNNING
> [INFO] commands-testsuite/jaxws                   SUCCESS  
> (0:00:41.232)
> [INFO] commands-testsuite/shutdown                RUNNING
> [INFO] commands-testsuite/shutdown                SUCCESS  
> (0:00:21.612)
> [INFO] concurrent-testsuite/concurrent-basic      RUNNING
> [INFO] concurrent-testsuite/concurrent-basic      SUCCESS  
> (0:06:36.297)
> [INFO] console-testsuite/advanced                 RUNNING
> [INFO] console-testsuite/advanced                 SUCCESS  
> (0:01:34.386)
> [INFO] console-testsuite/basic                    RUNNING
> [INFO] console-testsuite/basic                    SUCCESS  
> (0:02:02.926)
> [INFO] corba-testsuite/corba-helloworld           RUNNING
> [INFO] corba-testsuite/corba-helloworld           SUCCESS  
> (0:00:53.859)
> [INFO] corba-testsuite/corba-marshal              RUNNING
> [INFO] corba-testsuite/corba-marshal              SUCCESS  
> (0:00:47.690)
> [INFO] corba-testsuite/corba-mytime               RUNNING
> [INFO] corba-testsuite/corba-mytime               SUCCESS  
> (0:00:47.352)
> [INFO] deployment-testsuite/deployment-tests      RUNNING
> [INFO] deployment-testsuite/deployment-tests      SUCCESS  
> (0:00:34.048)
> [INFO] deployment-testsuite/jca-cms-tests         RUNNING
> [INFO] deployment-testsuite/jca-cms-tests         SUCCESS  
> (0:00:30.219)
> [INFO] deployment-testsuite/manifestcp-tests      RUNNING
> [INFO] deployment-testsuite/manifestcp-tests      SUCCESS  
> (0:00:35.109)
> [INFO] enterprise-testsuite/ejb-tests             RUNNING
> [INFO] enterprise-testsuite/ejb-tests             SUCCESS  
> (0:01:12.949)
> [INFO] enterprise-testsuite/jms-tests             RUNNING
> [INFO] enterprise-testsuite/jms-tests             FAILURE  
> (0:01:17.485) Java returned: 1
> [INFO] enterprise-testsuite/jpa-tests             RUNNING
> [INFO] enterprise-testsuite/jpa-tests             SUCCESS  
> (0:00:52.782)
> [INFO] enterprise-testsuite/sec-client            RUNNING
> [INFO] enterprise-testsuite/sec-client            SUCCESS  
> (0:00:30.773)
> [INFO] enterprise-testsuite/sec-tests             RUNNING
> [INFO] enterprise-testsuite/sec-tests             SUCCESS  
> (0:00:55.167)
> [INFO] security-testsuite/test-security           RUNNING
> [INFO] security-testsuite/test-security           FAILURE  
> (0:00:49.339) Java returned: 1
> [INFO] web-testsuite/test-2.1-jsps                RUNNING
> [INFO] web-testsuite/test-2.1-jsps                SUCCESS  
> (0:00:32.465)
> [INFO] web-testsuite/test-2.5-servlets            RUNNING
> [INFO] web-testsuite/test-2.5-servlets            SUCCESS  
> (0:00:32.460)
> [INFO] web-testsuite/test-myfaces                 RUNNING
> [INFO] web-testsuite/test-myfaces                 SUCCESS  
> (0:00:33.387)
> [INFO] web-testsuite/test-tomcat                  RUNNING
> [INFO] web-testsuite/test-tomcat                  SUCCESS  
> (0:00:24.184)
> [INFO] web-testsuite/test-web-forward             RUNNING
> [INFO] web-testsuite/test-web-forward             SUCCESS  
> (0:00:36.734)
> [INFO] web-testsuite/test-web-references          RUNNING
> [INFO] web-testsuite/test-web-references          SUCCESS  
> (0:00:43.872)
> [INFO] webservices-testsuite/jaxb-tests           RUNNING
> [INFO] webservices-testsuite/jaxb-tests           SUCCESS  
> (0:01:01.754)
> [INFO] webservices-testsuite/jaxr-tests           RUNNING
> [INFO] webservices-testsuite/jaxr-tests           SUCCESS  
> (0:01:01.576)
> [INFO] webservices-testsuite/jaxrpc-jaxws-tests   RUNNING
> [INFO] webservices-testsuite/jaxrpc-jaxws-tests   SUCCESS  
> (0:00:36.607)
> [INFO] webservices-testsuite/jaxrpc-tests         RUNNING
> [INFO] webservices-testsuite/jaxrpc-tests         SUCCESS  
> (0:00:53.657)
> [INFO] webservices-testsuite/jaxws-catalog-tests  RUNNING
> [INFO] webservices-testsuite/jaxws-catalog-tests  SUCCESS  
> (0:00:57.086)
> [INFO] webservices-testsuite/jaxws-mtom-tests     RUNNING
> [INFO] webservices-testsuite/jaxws-mtom-tests     SUCCESS  
> (0:00:47.956)
> [INFO] webservices-testsuite/jaxws-provider-tests RUNNING
> [INFO] webservices-testsuite/jaxws-provider-tests SUCCESS  
> (0:00:46.495)
> [INFO] webservices-testsuite/jaxws-tests          RUNNING
> [INFO] webservices-testsuite/jaxws-tests          SUCCESS  
> (0:02:04.541)
> [INFO] webservices-testsuite/jaxws-wsa-tests      RUNNING
> [INFO] webservices-testsuite/jaxws-wsa-tests      SUCCESS  
> (0:00:51.580)
> [INFO] webservices-testsuite/saaj-tests           RUNNING
> [INFO] webservices-testsuite/saaj-tests           SUCCESS  
> (0:00:41.182)
> [INFO] webservices-testsuite/stax-tests           RUNNING
> [INFO] webservices-testsuite/stax-tests           SUCCESS  
> (0:01:02.158)
> [INFO]
> [INFO]  
> -------------------------------------------------------------------------------
> [INFO] Test Summary (0:37:01.172)
> [INFO]     Passed: 34
> [INFO]     Failed: 2
> [INFO]  
> -------------------------------------------------------------------------------
> [INFO]
> [INFO] The following tests failed:
> [INFO]     * enterprise-testsuite/jms-tests - /home/geronimo/ 
> geronimo/trunk/testsuite/enterprise-testsuite/jms-tests/build.log
> [INFO]     * security-testsuite/test-security - /home/geronimo/ 
> geronimo/trunk/testsuite/security-testsuite/test-security/build.log
> [INFO]
> [INFO]  
> ------------------------------------------------------------------------
> [ERROR] BUILD ERROR
>
> Assembly: jetty
> =================================
> See full test results and logs at http://people.apache.org/builds/geronimo/server/binaries/trunk/20090814/logs-0900-jetty/
>
>
> [INFO] Using assembly artifact:  
> org.apache.geronimo.assemblies:geronimo-jetty7-javaee5:zip:bin:2.2- 
> SNAPSHOT:provided
> [INFO] Using geronimoHome: /home/geronimo/geronimo/trunk/testsuite/ 
> target/geronimo-jetty7-javaee5-2.2-SNAPSHOT
> [INFO] Installing assembly...
> [INFO] Expanding: /home/geronimo/.m2/repository/org/apache/geronimo/ 
> assemblies/geronimo-jetty7-javaee5/2.2-SNAPSHOT/geronimo-jetty7- 
> javaee5-2.2-SNAPSHOT-bin.zip into /home/geronimo/geronimo/trunk/ 
> testsuite/target
> [INFO] Starting Geronimo server...
> [INFO] Selected option set: default
> [INFO] Redirecting output to: /home/geronimo/geronimo/trunk/ 
> testsuite/target/geronimo-logs/ 
> org.apache.geronimo.mavenplugins.geronimo.server.StartServerMojo.log
> [INFO] Waiting for Geronimo server...
> [INFO] Geronimo server started in 0:00:47.446
> [INFO] [shitty:install {execution: default}]
> [INFO] Installing /home/geronimo/geronimo/trunk/testsuite/pom.xml  
> to /home/geronimo/.m2/repository/org/apache/geronimo/testsuite/ 
> testsuite/testing/testsuite-testing.pom
> [INFO] [shitty:test {execution: default}]
> [INFO] Starting 36 test builds
> [INFO]
> [INFO]  
> -------------------------------------------------------------------------------
> [INFO]
> [INFO] commands-testsuite/deploy                  RUNNING
> [INFO] commands-testsuite/deploy                  SUCCESS  
> (0:01:13.156)
> [INFO] commands-testsuite/gshell                  RUNNING
> [INFO] commands-testsuite/gshell                  SUCCESS  
> (0:00:35.968)
> [INFO] commands-testsuite/jaxws                   RUNNING
> [INFO] commands-testsuite/jaxws                   SUCCESS  
> (0:00:40.146)
> [INFO] commands-testsuite/shutdown                RUNNING
> [INFO] commands-testsuite/shutdown                SUCCESS  
> (0:00:21.183)
> [INFO] concurrent-testsuite/concurrent-basic      RUNNING
> [INFO] concurrent-testsuite/concurrent-basic      SUCCESS  
> (0:06:24.770)
> [INFO] console-testsuite/advanced                 RUNNING
> [INFO] console-testsuite/advanced                 FAILURE  
> (0:00:56.420) Java returned: 1
> [INFO] console-testsuite/basic                    RUNNING
> [INFO] console-testsuite/basic                    SUCCESS  
> (0:02:09.913)
> [INFO] corba-testsuite/corba-helloworld           RUNNING
> [INFO] corba-testsuite/corba-helloworld           SUCCESS  
> (0:00:53.564)
> [INFO] corba-testsuite/corba-marshal              RUNNING
> [INFO] corba-testsuite/corba-marshal              SUCCESS  
> (0:01:37.075)
> [INFO] corba-testsuite/corba-mytime               RUNNING
> [INFO] corba-testsuite/corba-mytime               SUCCESS  
> (0:00:47.515)
> [INFO] deployment-testsuite/deployment-tests      RUNNING
> [INFO] deployment-testsuite/deployment-tests      SUCCESS  
> (0:00:33.872)
> [INFO] deployment-testsuite/jca-cms-tests         RUNNING
> [INFO] deployment-testsuite/jca-cms-tests         SUCCESS  
> (0:00:30.475)
> [INFO] deployment-testsuite/manifestcp-tests      RUNNING
> [INFO] deployment-testsuite/manifestcp-tests      SUCCESS  
> (0:00:36.432)
> [INFO] enterprise-testsuite/ejb-tests             RUNNING
> [INFO] enterprise-testsuite/ejb-tests             SUCCESS  
> (0:00:48.110)
> [INFO] enterprise-testsuite/jms-tests             RUNNING
> [INFO] enterprise-testsuite/jms-tests             FAILURE  
> (0:01:13.970) Java returned: 1
> [INFO] enterprise-testsuite/jpa-tests             RUNNING
> [INFO] enterprise-testsuite/jpa-tests             SUCCESS  
> (0:00:46.647)
> [INFO] enterprise-testsuite/sec-client            RUNNING
> [INFO] enterprise-testsuite/sec-client            SUCCESS  
> (0:00:31.872)
> [INFO] enterprise-testsuite/sec-tests             RUNNING
> [INFO] enterprise-testsuite/sec-tests             SUCCESS  
> (0:00:53.506)
> [INFO] security-testsuite/test-security           RUNNING
> [INFO] security-testsuite/test-security           SUCCESS  
> (0:00:53.959)
> [INFO] web-testsuite/test-2.1-jsps                RUNNING
> [INFO] web-testsuite/test-2.1-jsps                SUCCESS  
> (0:00:33.514)
> [INFO] web-testsuite/test-2.5-servlets            RUNNING
> [INFO] web-testsuite/test-2.5-servlets            SUCCESS  
> (0:00:31.886)
> [INFO] web-testsuite/test-jetty                   RUNNING
> [INFO] web-testsuite/test-jetty                   SUCCESS  
> (0:00:26.739)
> [INFO] web-testsuite/test-myfaces                 RUNNING
> [INFO] web-testsuite/test-myfaces                 SUCCESS  
> (0:00:35.013)
> [INFO] web-testsuite/test-web-forward             RUNNING
> [INFO] web-testsuite/test-web-forward             SUCCESS  
> (0:00:39.122)
> [INFO] web-testsuite/test-web-references          RUNNING
> [INFO] web-testsuite/test-web-references          SUCCESS  
> (0:00:44.709)
> [INFO] webservices-testsuite/jaxb-tests           RUNNING
> [INFO] webservices-testsuite/jaxb-tests           SUCCESS  
> (0:01:03.200)
> [INFO] webservices-testsuite/jaxr-tests           RUNNING
> [INFO] webservices-testsuite/jaxr-tests           SUCCESS  
> (0:01:02.732)
> [INFO] webservices-testsuite/jaxrpc-jaxws-tests   RUNNING
> [INFO] webservices-testsuite/jaxrpc-jaxws-tests   SUCCESS  
> (0:00:32.134)
> [INFO] webservices-testsuite/jaxrpc-tests         RUNNING
> [INFO] webservices-testsuite/jaxrpc-tests         SUCCESS  
> (0:00:50.825)
> [INFO] webservices-testsuite/jaxws-catalog-tests  RUNNING
> [INFO] webservices-testsuite/jaxws-catalog-tests  SUCCESS  
> (0:00:53.635)
> [INFO] webservices-testsuite/jaxws-mtom-tests     RUNNING
> [INFO] webservices-testsuite/jaxws-mtom-tests     SUCCESS  
> (0:00:43.796)
> [INFO] webservices-testsuite/jaxws-provider-tests RUNNING
> [INFO] webservices-testsuite/jaxws-provider-tests SUCCESS  
> (0:00:50.234)
> [INFO] webservices-testsuite/jaxws-tests          RUNNING
> [INFO] webservices-testsuite/jaxws-tests          SUCCESS  
> (0:01:52.095)
> [INFO] webservices-testsuite/jaxws-wsa-tests      RUNNING
> [INFO] webservices-testsuite/jaxws-wsa-tests      SUCCESS  
> (0:00:45.806)
> [INFO] webservices-testsuite/saaj-tests           RUNNING
> [INFO] webservices-testsuite/saaj-tests           SUCCESS  
> (0:00:40.620)
> [INFO] webservices-testsuite/stax-tests           RUNNING
> [INFO] webservices-testsuite/stax-tests           SUCCESS  
> (0:01:04.230)
> [INFO]
> [INFO]  
> -------------------------------------------------------------------------------
> [INFO] Test Summary (0:36:19.050)
> [INFO]     Passed: 34
> [INFO]     Failed: 2
> [INFO]  
> -------------------------------------------------------------------------------
> [INFO]
> [INFO] The following tests failed:
> [INFO]     * console-testsuite/advanced - /home/geronimo/geronimo/ 
> trunk/testsuite/console-testsuite/advanced/build.log
> [INFO]     * enterprise-testsuite/jms-tests - /home/geronimo/ 
> geronimo/trunk/testsuite/enterprise-testsuite/jms-tests/build.log
> [INFO]
> [INFO]  
> ------------------------------------------------------------------------
> [ERROR] BUILD ERROR
>
> Samples: trunk
> =================================
> Log: http://people.apache.org/builds/geronimo/server/binaries/trunk/20090814/samples-0900.log
>
> Build status: OK
>
>
>
>
> -- 
> Ivan


Mime
View raw message