geronimo-dev mailing list archives

Site index · List index
Message view « Date » · « Thread »
Top « Date » · « Thread »
From ericp56 <eric.phettepl...@twcable.com>
Subject Re: Trunk build failed
Date Fri, 14 Aug 2009 19:15:31 GMT

-------------------------------------------------------
There are no tests to run.

Results :

Tests run: 0, Failures: 0, Errors: 0, Skipped: 0

[INFO] [jar:jar]
[INFO] Building jar:
C:\s\g\server\plugins\concurrent\geronimo-concurrent-management\target\geronimo-concurrent-management-2.2-SNAPSHOT
.jar
[INFO] [ianal:verify-legal-files {execution: default}]
[INFO] Checking legal files in:
geronimo-concurrent-management-2.2-SNAPSHOT.jar
[INFO] [install:install]
[INFO] Installing
C:\s\g\server\plugins\concurrent\geronimo-concurrent-management\target\geronimo-concurrent-management-2.2-SNAPSHOT.ja
r to C:\Documents and
Settings\E133871\.m2\repository\org\apache\geronimo\modules\geronimo-concurrent-management\2.2-SNAPSHOT\geronimo-
concurrent-management-2.2-SNAPSHOT.jar
[INFO]
------------------------------------------------------------------------
[INFO] Building Geronimo Plugins, Concurrency Utilities :: Core
[INFO]    task-segment: [install]
[INFO]
------------------------------------------------------------------------
[INFO] [genesis:validate-configuration {execution: default}]
[INFO] [enforcer:enforce {execution: default}]
[INFO] [resources:copy-resources {execution: copy-sources}]
[INFO] Using 'UTF-8' encoding to copy filtered resources.
[INFO] Copying 31 resources
[INFO] [remote-resources:process {execution: default}]
[INFO] [resources:resources]
[INFO] Using 'UTF-8' encoding to copy filtered resources.
[INFO] skip non existing resourceDirectory
C:\s\g\server\plugins\concurrent\geronimo-concurrent-core\src\main\resources
[INFO] skip non existing resourceDirectory
C:\s\g\server\plugins\concurrent\geronimo-concurrent-core\src\main\filtered-resources
[INFO] Copying 3 resources
[INFO] [compiler:compile]
[INFO] Nothing to compile - all classes are up to date
[INFO] [resources:testResources]
[INFO] Using 'UTF-8' encoding to copy filtered resources.
[INFO] Copying 1 resource
[INFO] skip non existing resourceDirectory
C:\s\g\server\plugins\concurrent\geronimo-concurrent-core\src\test\filtered-resources
[INFO] Copying 3 resources
[INFO] [compiler:testCompile]
[INFO] Nothing to compile - all classes are up to date
[INFO] [surefire:test]
[INFO] Surefire report directory:
C:\s\g\server\plugins\concurrent\geronimo-concurrent-core\target\surefire-reports

-------------------------------------------------------
 T E S T S
-------------------------------------------------------
Running
org.apache.geronimo.concurrent.executor.ServerManagedScheduledExecutorServiceTest
Tests run: 24, Failures: 0, Errors: 0, Skipped: 0, Time elapsed: 96.972 sec
Running
org.apache.geronimo.concurrent.executor.ComponentManagedExecutorServiceTest
Tests run: 15, Failures: 0, Errors: 0, Skipped: 0, Time elapsed: 22.107 sec
Running
org.apache.geronimo.concurrent.executor.ServerManagedExecutorServiceTest
Tests run: 15, Failures: 0, Errors: 0, Skipped: 0, Time elapsed: 22.075 sec
Running org.apache.geronimo.concurrent.context.ContextServiceTest
Tests run: 7, Failures: 0, Errors: 0, Skipped: 0, Time elapsed: 0.094 sec
Running org.apache.geronimo.concurrent.ManagedTaskUtilsTest
Tests run: 1, Failures: 0, Errors: 0, Skipped: 0, Time elapsed: 0 sec
Running org.apache.geronimo.concurrent.harmony.FutureTaskTest
Tests run: 6, Failures: 0, Errors: 0, Skipped: 0, Time elapsed: 96.097 sec
Running org.apache.geronimo.concurrent.thread.ManagedThreadFactoryTest
Tests run: 4, Failures: 0, Errors: 0, Skipped: 0, Time elapsed: 50.06 sec
Running org.apache.geronimo.concurrent.ManagedContextHandlerChainTest
Tests run: 3, Failures: 0, Errors: 0, Skipped: 0, Time elapsed: 0.015 sec
Running
org.apache.geronimo.concurrent.executor.ComponentManagedScheduledExecutorServiceTest
Tests run: 24, Failures: 1, Errors: 0, Skipped: 0, Time elapsed: 96.183 sec
<<< FAILURE!

Results :

Failed tests:
 
testTriggerSkipAndCancel(org.apache.geronimo.concurrent.executor.ComponentManagedScheduledExecutorServiceTest)

Tests run: 99, Failures: 1, Errors: 0, Skipped: 0

[INFO]
------------------------------------------------------------------------
[ERROR] BUILD FAILURE
[INFO]
------------------------------------------------------------------------
[INFO] There are test failures.

Please refer to
C:\s\g\server\plugins\concurrent\geronimo-concurrent-core\target\surefire-reports
for the individual test results.
[INFO]
------------------------------------------------------------------------
[INFO] For more information, run Maven with the -e switch
[INFO]
------------------------------------------------------------------------
[INFO] Total time: 37 minutes 4 seconds
[INFO] Finished at: Fri Aug 14 15:05:01 EDT 2009
[INFO] Final Memory: 358M/508M
[INFO]
------------------------------------------------------------------------
C:\s\g\server>


Here's the bottom of
...ComponentManagedScheduledExecutorServiceTest-output.txt

Thread[ManagedThread-g82-t1,5,ManagedThread-g82]
Expected : SUBMITTED
org.apache.geronimo.concurrent.executor.AbstractManagedScheduledExecutorService$ScheduledFutureTask@3bb2b8
org.apache.geronimo.concurrent.executor.ComponentManagedScheduledExecutorServiceTest$TestManagedScheduledExecutorService@152544e
random data 166
Actual   : SUBMITTED
org.apache.geronimo.concurrent.executor.AbstractManagedScheduledExecutorService$ScheduledFutureTask@3bb2b8
org.apache.geronimo.concurrent.executor.ComponentManagedScheduledExecutorServiceTest$TestManagedScheduledExecutorService@152544e
random data 166
Expected : STARTING
org.apache.geronimo.concurrent.executor.AbstractManagedScheduledExecutorService$ScheduledFutureTask@3bb2b8
org.apache.geronimo.concurrent.executor.ComponentManagedScheduledExecutorServiceTest$TestManagedScheduledExecutorService@152544e
random data 166
Actual   : STARTING
org.apache.geronimo.concurrent.executor.AbstractManagedScheduledExecutorService$ScheduledFutureTask@3bb2b8
org.apache.geronimo.concurrent.executor.ComponentManagedScheduledExecutorServiceTest$TestManagedScheduledExecutorService@152544e
random data 166
Expected : ABORTED
org.apache.geronimo.concurrent.executor.AbstractManagedScheduledExecutorService$ScheduledFutureTask@3bb2b8
org.apache.geronimo.concurrent.executor.ComponentManagedScheduledExecutorServiceTest$TestManagedScheduledExecutorService@152544e
random data 166
Actual   : ABORTED
org.apache.geronimo.concurrent.executor.AbstractManagedScheduledExecutorService$ScheduledFutureTask@3bb2b8
org.apache.geronimo.concurrent.executor.ComponentManagedScheduledExecutorServiceTest$TestManagedScheduledExecutorService@152544e
random data 166 java.util.concurrent.CancellationException
Expected : DONE
org.apache.geronimo.concurrent.executor.AbstractManagedScheduledExecutorService$ScheduledFutureTask@3bb2b8
org.apache.geronimo.concurrent.executor.ComponentManagedScheduledExecutorServiceTest$TestManagedScheduledExecutorService@152544e
random data 166
Actual   : DONE
org.apache.geronimo.concurrent.executor.AbstractManagedScheduledExecutorService$ScheduledFutureTask@3bb2b8
org.apache.geronimo.concurrent.executor.ComponentManagedScheduledExecutorServiceTest$TestManagedScheduledExecutorService@152544e
random data 166 java.lang.InterruptedException: sleep interrupted

-- 
View this message in context: http://www.nabble.com/Trunk-build-failed-tp24974418s134p24977054.html
Sent from the Apache Geronimo - Dev mailing list archive at Nabble.com.


Mime
View raw message