geronimo-dev mailing list archives

Site index · List index
Message view « Date » · « Thread »
Top « Date » · « Thread »
From ga...@apache.org
Subject [BUILD] trunk: Failed for Revision: 809402
Date Sun, 30 Aug 2009 19:20:01 GMT
Geronimo Revision: 809402 built with tests included
 
See the full build-1500.log file at http://people.apache.org/builds/geronimo/server/binaries/trunk/20090830/build-1500.log
 
 
See the unit test reports at http://people.apache.org/builds/geronimo/server/binaries/trunk/20090830/unit-test-reports
 
[INFO] snapshot org.eclipse.jetty:jetty-security:8.0.0.M0-SNAPSHOT: checking for updates from
jetty-snapshots.oss.sonatype.org
[INFO] snapshot org.eclipse.jetty:jetty-security:8.0.0.M0-SNAPSHOT: checking for updates from
codehaus.snapshots
[INFO] snapshot org.eclipse.jetty:jetty-security:8.0.0.M0-SNAPSHOT: checking for updates from
apache.snapshots
[INFO] snapshot org.eclipse.jetty:jetty-security:8.0.0.M0-SNAPSHOT: checking for updates from
repository.apache.org
[INFO] snapshot org.eclipse.jetty:jetty-security:8.0.0.M0-SNAPSHOT: checking for updates from
oss.sonatype.org
Downloading: http://oss.sonatype.org/content/repositories/jetty-snapshots//org/eclipse/jetty/jetty-security/8.0.0.M0-SNAPSHOT/jetty-security-8.0.0.M0-20090829.140307-2.pom
2K downloaded
[INFO] snapshot org.eclipse.jetty:jetty-webapp:8.0.0.M0-SNAPSHOT: checking for updates from
jetty-snapshots.oss.sonatype.org
[INFO] snapshot org.eclipse.jetty:jetty-webapp:8.0.0.M0-SNAPSHOT: checking for updates from
codehaus.snapshots
[INFO] snapshot org.eclipse.jetty:jetty-webapp:8.0.0.M0-SNAPSHOT: checking for updates from
apache.snapshots
Downloading: http://oss.sonatype.org/content/repositories/jetty-snapshots//org/eclipse/jetty/jetty-webapp/8.0.0.M0-SNAPSHOT/jetty-webapp-8.0.0.M0-20090829.140307-2.pom
3K downloaded
[INFO] snapshot org.eclipse.jetty:jetty-xml:8.0.0.M0-SNAPSHOT: checking for updates from jetty-snapshots.oss.sonatype.org
[INFO] snapshot org.eclipse.jetty:jetty-xml:8.0.0.M0-SNAPSHOT: checking for updates from codehaus.snapshots
[INFO] snapshot org.eclipse.jetty:jetty-xml:8.0.0.M0-SNAPSHOT: checking for updates from apache.snapshots
[INFO] snapshot org.eclipse.jetty:jetty-xml:8.0.0.M0-SNAPSHOT: checking for updates from oss.sonatype.org
Downloading: http://oss.sonatype.org/content/repositories/jetty-snapshots//org/eclipse/jetty/jetty-xml/8.0.0.M0-SNAPSHOT/jetty-xml-8.0.0.M0-20090829.140307-2.pom
2K downloaded
[INFO] snapshot org.eclipse.jetty:jetty-servlet:8.0.0.M0-SNAPSHOT: checking for updates from
jetty-snapshots.oss.sonatype.org
[INFO] snapshot org.eclipse.jetty:jetty-servlet:8.0.0.M0-SNAPSHOT: checking for updates from
codehaus.snapshots
[INFO] snapshot org.eclipse.jetty:jetty-servlet:8.0.0.M0-SNAPSHOT: checking for updates from
apache.snapshots
[INFO] snapshot org.eclipse.jetty:jetty-servlet:8.0.0.M0-SNAPSHOT: checking for updates from
oss.sonatype.org
Downloading: http://oss.sonatype.org/content/repositories/jetty-snapshots//org/eclipse/jetty/jetty-servlet/8.0.0.M0-SNAPSHOT/jetty-servlet-8.0.0.M0-20090829.140307-2.pom
1K downloaded
Downloading: http://oss.sonatype.org/content/repositories/jetty-snapshots//org/eclipse/jetty/jetty-ajp/8.0.0.M0-SNAPSHOT/jetty-ajp-8.0.0.M0-20090829.140307-2.jar
30K downloaded
Downloading: http://oss.sonatype.org/content/repositories/jetty-snapshots//org/eclipse/jetty/jetty-server/8.0.0.M0-SNAPSHOT/jetty-server-8.0.0.M0-20090829.140307-2.jar
254K downloaded
Downloading: http://oss.sonatype.org/content/repositories/jetty-snapshots//org/eclipse/jetty/jetty-continuation/8.0.0.M0-SNAPSHOT/jetty-continuation-8.0.0.M0-20090829.140307-2.jar
19K downloaded
Downloading: http://oss.sonatype.org/content/repositories/jetty-snapshots//org/eclipse/jetty/jetty-http/8.0.0.M0-SNAPSHOT/jetty-http-8.0.0.M0-20090829.140307-2.jar
107K downloaded
Downloading: http://oss.sonatype.org/content/repositories/jetty-snapshots//org/eclipse/jetty/jetty-io/8.0.0.M0-SNAPSHOT/jetty-io-8.0.0.M0-20090829.140307-2.jar
66K downloaded
Downloading: http://oss.sonatype.org/content/repositories/jetty-snapshots//org/eclipse/jetty/jetty-util/8.0.0.M0-SNAPSHOT/jetty-util-8.0.0.M0-20090829.140307-2.jar
181K downloaded
Downloading: http://oss.sonatype.org/content/repositories/jetty-snapshots//org/eclipse/jetty/jetty-jaspi/8.0.0.M0-SNAPSHOT/jetty-jaspi-8.0.0.M0-20090829.140307-2.jar
35K downloaded
Downloading: http://oss.sonatype.org/content/repositories/jetty-snapshots//org/eclipse/jetty/jetty-security/8.0.0.M0-SNAPSHOT/jetty-security-8.0.0.M0-20090829.140307-2.jar
66K downloaded
Downloading: http://oss.sonatype.org/content/repositories/jetty-snapshots//org/eclipse/jetty/jetty-webapp/8.0.0.M0-SNAPSHOT/jetty-webapp-8.0.0.M0-20090829.140307-2.jar
59K downloaded
Downloading: http://oss.sonatype.org/content/repositories/jetty-snapshots//org/eclipse/jetty/jetty-xml/8.0.0.M0-SNAPSHOT/jetty-xml-8.0.0.M0-20090829.140307-2.jar
28K downloaded
Downloading: http://oss.sonatype.org/content/repositories/jetty-snapshots//org/eclipse/jetty/jetty-servlet/8.0.0.M0-SNAPSHOT/jetty-servlet-8.0.0.M0-20090829.140307-2.jar
73K downloaded
[INFO] [enforcer:enforce {execution: default}]
[INFO] [remote-resources:process {execution: default}]
[INFO] [resources:resources]
[INFO] Using 'UTF-8' encoding to copy filtered resources.
[INFO] Copying 1 resource
[INFO] skip non existing resourceDirectory /home/geronimo/geronimo/trunk/plugins/jetty7/geronimo-jetty7/src/main/filtered-resources
[INFO] Copying 3 resources
[INFO] [compiler:compile]
[INFO] Compiling 51 source files to /home/geronimo/geronimo/trunk/plugins/jetty7/geronimo-jetty7/target/classes
[INFO] ------------------------------------------------------------------------
[ERROR] BUILD FAILURE
[INFO] ------------------------------------------------------------------------
[INFO] Compilation failure

/home/geronimo/geronimo/trunk/plugins/jetty7/geronimo-jetty7/src/main/java/org/apache/geronimo/jetty7/connector/JettyConnector.java:[90,23]
[deprecation] getHeaderBufferSize() in org.eclipse.jetty.http.HttpBuffers has been deprecated

/home/geronimo/geronimo/trunk/plugins/jetty7/geronimo-jetty7/src/main/java/org/apache/geronimo/jetty7/connector/JettyConnector.java:[93,16]
[deprecation] setHeaderBufferSize(int) in org.eclipse.jetty.http.HttpBuffers has been deprecated

/home/geronimo/geronimo/trunk/plugins/jetty7/geronimo-jetty7/src/main/java/org/apache/geronimo/jetty7/security/JettySecurityHandlerFactory.java:[103,28]
cannot find symbol
symbol  : constructor FormAuthenticator(java.lang.String,java.lang.String)
location: class org.eclipse.jetty.security.authentication.FormAuthenticator


[INFO] ------------------------------------------------------------------------
[INFO] Trace
org.apache.maven.BuildFailureException: Compilation failure
	at org.apache.maven.lifecycle.DefaultLifecycleExecutor.executeGoals(DefaultLifecycleExecutor.java:580)
	at org.apache.maven.lifecycle.DefaultLifecycleExecutor.executeGoalWithLifecycle(DefaultLifecycleExecutor.java:500)
	at org.apache.maven.lifecycle.DefaultLifecycleExecutor.executeGoal(DefaultLifecycleExecutor.java:479)
	at org.apache.maven.lifecycle.DefaultLifecycleExecutor.executeGoalAndHandleFailures(DefaultLifecycleExecutor.java:331)
	at org.apache.maven.lifecycle.DefaultLifecycleExecutor.executeTaskSegments(DefaultLifecycleExecutor.java:292)
	at org.apache.maven.lifecycle.DefaultLifecycleExecutor.execute(DefaultLifecycleExecutor.java:142)
	at org.apache.maven.DefaultMaven.doExecute(DefaultMaven.java:336)
	at org.apache.maven.DefaultMaven.execute(DefaultMaven.java:129)
	at org.apache.maven.cli.MavenCli.main(MavenCli.java:301)
	at sun.reflect.NativeMethodAccessorImpl.invoke0(Native Method)
	at sun.reflect.NativeMethodAccessorImpl.invoke(NativeMethodAccessorImpl.java:39)
	at sun.reflect.DelegatingMethodAccessorImpl.invoke(DelegatingMethodAccessorImpl.java:25)
	at java.lang.reflect.Method.invoke(Method.java:597)
	at org.codehaus.classworlds.Launcher.launchEnhanced(Launcher.java:315)
	at org.codehaus.classworlds.Launcher.launch(Launcher.java:255)
	at org.codehaus.classworlds.Launcher.mainWithExitCode(Launcher.java:430)
	at org.codehaus.classworlds.Launcher.main(Launcher.java:375)
Caused by: org.apache.maven.plugin.CompilationFailureException: Compilation failure
	at org.apache.maven.plugin.AbstractCompilerMojo.execute(AbstractCompilerMojo.java:516)
	at org.apache.maven.plugin.CompilerMojo.execute(CompilerMojo.java:114)
	at org.apache.maven.plugin.DefaultPluginManager.executeMojo(DefaultPluginManager.java:453)
	at org.apache.maven.lifecycle.DefaultLifecycleExecutor.executeGoals(DefaultLifecycleExecutor.java:559)
	... 16 more
[INFO] ------------------------------------------------------------------------
[INFO] Total time: 14 minutes 59 seconds
[INFO] Finished at: Sun Aug 30 15:16:42 EDT 2009
[INFO] Final Memory: 486M/659M
[INFO] ------------------------------------------------------------------------

Mime
View raw message