geronimo-dev mailing list archives

Site index · List index
Message view « Date » · « Thread »
Top « Date » · « Thread »
From ga...@apache.org
Subject [BUILD] branches/2.2: Failed for Revision: 809180
Date Sat, 29 Aug 2009 20:34:58 GMT
Geronimo Revision: 809180 built with tests included
 
See the full build-1400.log file at http://people.apache.org/builds/geronimo/server/binaries/2.2/20090829/build-1400.log
 
Download the binaries from http://people.apache.org/builds/geronimo/server/binaries/2.2/20090829
[INFO] BUILD SUCCESSFUL
[INFO] ------------------------------------------------------------------------
[INFO] Total time: 44 minutes 22 seconds
[INFO] Finished at: Sat Aug 29 14:49:23 EDT 2009
[INFO] Final Memory: 402M/1006M
[INFO] ------------------------------------------------------------------------
 
TESTSUITE RESULTS (Failures only)
=================================
 
Assembly: tomcat
=================================
See full test results and logs at http://people.apache.org/builds/geronimo/server/binaries/2.2/20090829/logs-1400-tomcat/
 
 
[INFO] snapshot org.apache.geronimo.assemblies:geronimo-tomcat6-javaee5:2.2-SNAPSHOT: checking
for updates from apache.snapshots
[INFO] Using assembly artifact: org.apache.geronimo.assemblies:geronimo-tomcat6-javaee5:zip:bin:2.2-SNAPSHOT:provided
[INFO] Using geronimoHome: /home/geronimo/geronimo/2.2/testsuite/target/geronimo-tomcat6-javaee5-2.2-SNAPSHOT
[INFO] Installing assembly...
[INFO] Expanding: /home/geronimo/.m2/repository/org/apache/geronimo/assemblies/geronimo-tomcat6-javaee5/2.2-SNAPSHOT/geronimo-tomcat6-javaee5-2.2-SNAPSHOT-bin.zip
into /home/geronimo/geronimo/2.2/testsuite/target
[INFO] Starting Geronimo server...
[INFO] Selected option set: default
[INFO] Redirecting output to: /home/geronimo/geronimo/2.2/testsuite/target/geronimo-logs/org.apache.geronimo.mavenplugins.geronimo.server.StartServerMojo.log
[INFO] Waiting for Geronimo server...
[INFO] Geronimo server started in 0:00:47.613
[INFO] [shitty:install {execution: default}]
[INFO] Installing /home/geronimo/geronimo/2.2/testsuite/pom.xml to /home/geronimo/.m2/repository/org/apache/geronimo/testsuite/testsuite/testing/testsuite-testing.pom
[INFO] [shitty:test {execution: default}]
[INFO] Starting 36 test builds
[INFO] 
[INFO] -------------------------------------------------------------------------------
[INFO] 
[INFO] commands-testsuite/deploy                  RUNNING
[INFO] commands-testsuite/deploy                  SUCCESS (0:01:23.002) 
[INFO] commands-testsuite/gshell                  RUNNING
[INFO] commands-testsuite/gshell                  SUCCESS (0:00:38.979) 
[INFO] commands-testsuite/jaxws                   RUNNING
[INFO] commands-testsuite/jaxws                   SUCCESS (0:00:45.980) 
[INFO] commands-testsuite/shutdown                RUNNING
[INFO] commands-testsuite/shutdown                SUCCESS (0:00:23.514) 
[INFO] concurrent-testsuite/concurrent-basic      RUNNING
[INFO] concurrent-testsuite/concurrent-basic      SUCCESS (0:06:39.378) 
[INFO] console-testsuite/advanced                 RUNNING
[INFO] console-testsuite/advanced                 SUCCESS (0:01:41.628) 
[INFO] console-testsuite/basic                    RUNNING
[INFO] console-testsuite/basic                    SUCCESS (0:02:08.722) 
[INFO] corba-testsuite/corba-helloworld           RUNNING
[INFO] corba-testsuite/corba-helloworld           SUCCESS (0:00:59.289) 
[INFO] corba-testsuite/corba-marshal              RUNNING
[INFO] corba-testsuite/corba-marshal              SUCCESS (0:01:12.235) 
[INFO] corba-testsuite/corba-mytime               RUNNING
[INFO] corba-testsuite/corba-mytime               SUCCESS (0:00:52.378) 
[INFO] deployment-testsuite/deployment-tests      RUNNING
[INFO] deployment-testsuite/deployment-tests      SUCCESS (0:00:37.514) 
[INFO] deployment-testsuite/jca-cms-tests         RUNNING
[INFO] deployment-testsuite/jca-cms-tests         SUCCESS (0:00:36.585) 
[INFO] deployment-testsuite/manifestcp-tests      RUNNING
[INFO] deployment-testsuite/manifestcp-tests      SUCCESS (0:00:41.712) 
[INFO] enterprise-testsuite/ejb-tests             RUNNING
[INFO] enterprise-testsuite/ejb-tests             SUCCESS (0:01:12.889) 
[INFO] enterprise-testsuite/jms-tests             RUNNING
[INFO] enterprise-testsuite/jms-tests             FAILURE (0:01:16.190) Java returned: 1
[INFO] enterprise-testsuite/jpa-tests             RUNNING
[INFO] enterprise-testsuite/jpa-tests             SUCCESS (0:00:58.075) 
[INFO] enterprise-testsuite/sec-client-tests      RUNNING
[INFO] enterprise-testsuite/sec-client-tests      SUCCESS (0:00:35.218) 
[INFO] enterprise-testsuite/sec-tests             RUNNING
[INFO] enterprise-testsuite/sec-tests             SUCCESS (0:01:02.750) 
[INFO] security-testsuite/test-security           RUNNING
[INFO] security-testsuite/test-security           SUCCESS (0:00:57.971) 
[INFO] web-testsuite/test-2.1-jsps                RUNNING
[INFO] web-testsuite/test-2.1-jsps                SUCCESS (0:00:36.818) 
[INFO] web-testsuite/test-2.5-servlets            RUNNING
[INFO] web-testsuite/test-2.5-servlets            SUCCESS (0:00:35.855) 
[INFO] web-testsuite/test-myfaces                 RUNNING
[INFO] web-testsuite/test-myfaces                 SUCCESS (0:00:38.004) 
[INFO] web-testsuite/test-tomcat                  RUNNING
[INFO] web-testsuite/test-tomcat                  SUCCESS (0:00:27.647) 
[INFO] web-testsuite/test-web-forward             RUNNING
[INFO] web-testsuite/test-web-forward             SUCCESS (0:00:44.254) 
[INFO] web-testsuite/test-web-references          RUNNING
[INFO] web-testsuite/test-web-references          SUCCESS (0:00:50.470) 
[INFO] webservices-testsuite/jaxb-tests           RUNNING
[INFO] webservices-testsuite/jaxb-tests           SUCCESS (0:01:10.410) 
[INFO] webservices-testsuite/jaxr-tests           RUNNING
[INFO] webservices-testsuite/jaxr-tests           SUCCESS (0:01:09.538) 
[INFO] webservices-testsuite/jaxrpc-jaxws-tests   RUNNING
[INFO] webservices-testsuite/jaxrpc-jaxws-tests   SUCCESS (0:00:41.622) 
[INFO] webservices-testsuite/jaxrpc-tests         RUNNING
[INFO] webservices-testsuite/jaxrpc-tests         SUCCESS (0:00:58.948) 
[INFO] webservices-testsuite/jaxws-catalog-tests  RUNNING
[INFO] webservices-testsuite/jaxws-catalog-tests  SUCCESS (0:01:00.344) 
[INFO] webservices-testsuite/jaxws-mtom-tests     RUNNING
[INFO] webservices-testsuite/jaxws-mtom-tests     SUCCESS (0:00:56.278) 
[INFO] webservices-testsuite/jaxws-provider-tests RUNNING
[INFO] webservices-testsuite/jaxws-provider-tests SUCCESS (0:00:52.437) 
[INFO] webservices-testsuite/jaxws-tests          RUNNING
[INFO] webservices-testsuite/jaxws-tests          SUCCESS (0:02:20.154) 
[INFO] webservices-testsuite/jaxws-wsa-tests      RUNNING
[INFO] webservices-testsuite/jaxws-wsa-tests      SUCCESS (0:00:56.000) 
[INFO] webservices-testsuite/saaj-tests           RUNNING
[INFO] webservices-testsuite/saaj-tests           SUCCESS (0:00:46.419) 
[INFO] webservices-testsuite/stax-tests           RUNNING
[INFO] webservices-testsuite/stax-tests           SUCCESS (0:01:10.615) 
[INFO] 
[INFO] -------------------------------------------------------------------------------
[INFO] Test Summary (0:40:40.059)
[INFO]     Passed: 35
[INFO]     Failed: 1
[INFO] -------------------------------------------------------------------------------
[INFO] 
[INFO] The following tests failed:
[INFO]     * enterprise-testsuite/jms-tests - /home/geronimo/geronimo/2.2/testsuite/enterprise-testsuite/jms-tests/build.log
[INFO] 
[INFO] ------------------------------------------------------------------------
[ERROR] BUILD ERROR
 
Assembly: jetty
=================================
See full test results and logs at http://people.apache.org/builds/geronimo/server/binaries/2.2/20090829/logs-1400-jetty/
 
 
[INFO] snapshot org.apache.geronimo.assemblies:geronimo-jetty7-javaee5:2.2-SNAPSHOT: checking
for updates from apache.snapshots
[INFO] Using assembly artifact: org.apache.geronimo.assemblies:geronimo-jetty7-javaee5:zip:bin:2.2-SNAPSHOT:provided
[INFO] Using geronimoHome: /home/geronimo/geronimo/2.2/testsuite/target/geronimo-jetty7-javaee5-2.2-SNAPSHOT
[INFO] Installing assembly...
[INFO] Expanding: /home/geronimo/.m2/repository/org/apache/geronimo/assemblies/geronimo-jetty7-javaee5/2.2-SNAPSHOT/geronimo-jetty7-javaee5-2.2-SNAPSHOT-bin.zip
into /home/geronimo/geronimo/2.2/testsuite/target
[INFO] Starting Geronimo server...
[INFO] Selected option set: default
[INFO] Redirecting output to: /home/geronimo/geronimo/2.2/testsuite/target/geronimo-logs/org.apache.geronimo.mavenplugins.geronimo.server.StartServerMojo.log
[INFO] Waiting for Geronimo server...
[INFO] Geronimo server started in 0:00:48.801
[INFO] [shitty:install {execution: default}]
[INFO] Installing /home/geronimo/geronimo/2.2/testsuite/pom.xml to /home/geronimo/.m2/repository/org/apache/geronimo/testsuite/testsuite/testing/testsuite-testing.pom
[INFO] [shitty:test {execution: default}]
[INFO] Starting 36 test builds
[INFO] 
[INFO] -------------------------------------------------------------------------------
[INFO] 
[INFO] commands-testsuite/deploy                  RUNNING
[INFO] commands-testsuite/deploy                  SUCCESS (0:01:21.152) 
[INFO] commands-testsuite/gshell                  RUNNING
[INFO] commands-testsuite/gshell                  SUCCESS (0:00:39.969) 
[INFO] commands-testsuite/jaxws                   RUNNING
[INFO] commands-testsuite/jaxws                   SUCCESS (0:00:44.515) 
[INFO] commands-testsuite/shutdown                RUNNING
[INFO] commands-testsuite/shutdown                SUCCESS (0:00:23.443) 
[INFO] concurrent-testsuite/concurrent-basic      RUNNING
[INFO] concurrent-testsuite/concurrent-basic      SUCCESS (0:06:30.919) 
[INFO] console-testsuite/advanced                 RUNNING
[INFO] console-testsuite/advanced                 SUCCESS (0:01:38.780) 
[INFO] console-testsuite/basic                    RUNNING
[INFO] console-testsuite/basic                    SUCCESS (0:02:14.534) 
[INFO] corba-testsuite/corba-helloworld           RUNNING
[INFO] corba-testsuite/corba-helloworld           SUCCESS (0:00:57.603) 
[INFO] corba-testsuite/corba-marshal              RUNNING
[INFO] corba-testsuite/corba-marshal              SUCCESS (0:01:11.811) 
[INFO] corba-testsuite/corba-mytime               RUNNING
[INFO] corba-testsuite/corba-mytime               SUCCESS (0:00:51.725) 
[INFO] deployment-testsuite/deployment-tests      RUNNING
[INFO] deployment-testsuite/deployment-tests      SUCCESS (0:00:37.641) 
[INFO] deployment-testsuite/jca-cms-tests         RUNNING
[INFO] deployment-testsuite/jca-cms-tests         SUCCESS (0:00:33.853) 
[INFO] deployment-testsuite/manifestcp-tests      RUNNING
[INFO] deployment-testsuite/manifestcp-tests      SUCCESS (0:00:39.234) 
[INFO] enterprise-testsuite/ejb-tests             RUNNING
[INFO] enterprise-testsuite/ejb-tests             SUCCESS (0:00:53.097) 
[INFO] enterprise-testsuite/jms-tests             RUNNING
[INFO] enterprise-testsuite/jms-tests             FAILURE (0:01:18.275) Java returned: 1
[INFO] enterprise-testsuite/jpa-tests             RUNNING
[INFO] enterprise-testsuite/jpa-tests             SUCCESS (0:00:50.525) 
[INFO] enterprise-testsuite/sec-client-tests      RUNNING
[INFO] enterprise-testsuite/sec-client-tests      SUCCESS (0:00:35.620) 
[INFO] enterprise-testsuite/sec-tests             RUNNING
[INFO] enterprise-testsuite/sec-tests             SUCCESS (0:00:58.931) 
[INFO] security-testsuite/test-security           RUNNING
[INFO] security-testsuite/test-security           SUCCESS (0:00:59.984) 
[INFO] web-testsuite/test-2.1-jsps                RUNNING
[INFO] web-testsuite/test-2.1-jsps                SUCCESS (0:00:36.608) 
[INFO] web-testsuite/test-2.5-servlets            RUNNING
[INFO] web-testsuite/test-2.5-servlets            SUCCESS (0:00:36.889) 
[INFO] web-testsuite/test-jetty                   RUNNING
[INFO] web-testsuite/test-jetty                   SUCCESS (0:00:28.380) 
[INFO] web-testsuite/test-myfaces                 RUNNING
[INFO] web-testsuite/test-myfaces                 SUCCESS (0:00:37.686) 
[INFO] web-testsuite/test-web-forward             RUNNING
[INFO] web-testsuite/test-web-forward             SUCCESS (0:00:43.622) 
[INFO] web-testsuite/test-web-references          RUNNING
[INFO] web-testsuite/test-web-references          SUCCESS (0:00:48.684) 
[INFO] webservices-testsuite/jaxb-tests           RUNNING
[INFO] webservices-testsuite/jaxb-tests           SUCCESS (0:01:12.930) 
[INFO] webservices-testsuite/jaxr-tests           RUNNING
[INFO] webservices-testsuite/jaxr-tests           SUCCESS (0:01:10.145) 
[INFO] webservices-testsuite/jaxrpc-jaxws-tests   RUNNING
[INFO] webservices-testsuite/jaxrpc-jaxws-tests   SUCCESS (0:00:34.823) 
[INFO] webservices-testsuite/jaxrpc-tests         RUNNING
[INFO] webservices-testsuite/jaxrpc-tests         SUCCESS (0:00:58.210) 
[INFO] webservices-testsuite/jaxws-catalog-tests  RUNNING
[INFO] webservices-testsuite/jaxws-catalog-tests  SUCCESS (0:00:58.366) 
[INFO] webservices-testsuite/jaxws-mtom-tests     RUNNING
[INFO] webservices-testsuite/jaxws-mtom-tests     SUCCESS (0:00:49.097) 
[INFO] webservices-testsuite/jaxws-provider-tests RUNNING
[INFO] webservices-testsuite/jaxws-provider-tests SUCCESS (0:00:55.682) 
[INFO] webservices-testsuite/jaxws-tests          RUNNING
[INFO] webservices-testsuite/jaxws-tests          SUCCESS (0:02:09.288) 
[INFO] webservices-testsuite/jaxws-wsa-tests      RUNNING
[INFO] webservices-testsuite/jaxws-wsa-tests      SUCCESS (0:00:51.199) 
[INFO] webservices-testsuite/saaj-tests           RUNNING
[INFO] webservices-testsuite/saaj-tests           SUCCESS (0:00:45.495) 
[INFO] webservices-testsuite/stax-tests           RUNNING
[INFO] webservices-testsuite/stax-tests           SUCCESS (0:01:11.902) 
[INFO] 
[INFO] -------------------------------------------------------------------------------
[INFO] Test Summary (0:39:30.851)
[INFO]     Passed: 35
[INFO]     Failed: 1
[INFO] -------------------------------------------------------------------------------
[INFO] 
[INFO] The following tests failed:
[INFO]     * enterprise-testsuite/jms-tests - /home/geronimo/geronimo/2.2/testsuite/enterprise-testsuite/jms-tests/build.log
[INFO] 
[INFO] ------------------------------------------------------------------------
[ERROR] BUILD ERROR
 
Samples: branches/2.2
=================================
Log: http://people.apache.org/builds/geronimo/server/binaries/2.2/20090829/samples-1400.log
 
Build status: OK
 

Mime
View raw message