geronimo-dev mailing list archives

Site index · List index
Message view « Date » · « Thread »
Top « Date » · « Thread »
From ga...@apache.org
Subject [BUILD] branches/2.2: Failed for Revision: 808683
Date Fri, 28 Aug 2009 02:33:52 GMT
Geronimo Revision: 808683 built with tests included
 
See the full build-2000.log file at http://people.apache.org/builds/geronimo/server/binaries/2.2/20090827/build-2000.log
 
Download the binaries from http://people.apache.org/builds/geronimo/server/binaries/2.2/20090827
[INFO] BUILD SUCCESSFUL
[INFO] ------------------------------------------------------------------------
[INFO] Total time: 41 minutes 27 seconds
[INFO] Finished at: Thu Aug 27 20:46:44 EDT 2009
[INFO] Final Memory: 434M/1003M
[INFO] ------------------------------------------------------------------------
 
TESTSUITE RESULTS (Failures only)
=================================
 
Assembly: tomcat
=================================
See full test results and logs at http://people.apache.org/builds/geronimo/server/binaries/2.2/20090827/logs-2000-tomcat/
 
 
[INFO] snapshot org.apache.geronimo.assemblies:geronimo-tomcat6-javaee5:2.2-SNAPSHOT: checking
for updates from apache.snapshots
[INFO] Using assembly artifact: org.apache.geronimo.assemblies:geronimo-tomcat6-javaee5:zip:bin:2.2-SNAPSHOT:provided
[INFO] Using geronimoHome: /home/geronimo/geronimo/2.2/testsuite/target/geronimo-tomcat6-javaee5-2.2-SNAPSHOT
[INFO] Installing assembly...
[INFO] Expanding: /home/geronimo/.m2/repository/org/apache/geronimo/assemblies/geronimo-tomcat6-javaee5/2.2-SNAPSHOT/geronimo-tomcat6-javaee5-2.2-SNAPSHOT-bin.zip
into /home/geronimo/geronimo/2.2/testsuite/target
[INFO] Starting Geronimo server...
[INFO] Selected option set: default
[INFO] Redirecting output to: /home/geronimo/geronimo/2.2/testsuite/target/geronimo-logs/org.apache.geronimo.mavenplugins.geronimo.server.StartServerMojo.log
[INFO] Waiting for Geronimo server...
[INFO] Geronimo server started in 0:00:45.856
[INFO] [shitty:install {execution: default}]
[INFO] Installing /home/geronimo/geronimo/2.2/testsuite/pom.xml to /home/geronimo/.m2/repository/org/apache/geronimo/testsuite/testsuite/testing/testsuite-testing.pom
[INFO] [shitty:test {execution: default}]
[INFO] Starting 36 test builds
[INFO] 
[INFO] -------------------------------------------------------------------------------
[INFO] 
[INFO] commands-testsuite/deploy                  RUNNING
[INFO] commands-testsuite/deploy                  SUCCESS (0:01:23.934) 
[INFO] commands-testsuite/gshell                  RUNNING
[INFO] commands-testsuite/gshell                  SUCCESS (0:00:38.721) 
[INFO] commands-testsuite/jaxws                   RUNNING
[INFO] commands-testsuite/jaxws                   SUCCESS (0:00:46.938) 
[INFO] commands-testsuite/shutdown                RUNNING
[INFO] commands-testsuite/shutdown                SUCCESS (0:00:24.123) 
[INFO] concurrent-testsuite/concurrent-basic      RUNNING
[INFO] concurrent-testsuite/concurrent-basic      SUCCESS (0:06:45.713) 
[INFO] console-testsuite/advanced                 RUNNING
[INFO] console-testsuite/advanced                 SUCCESS (0:01:40.806) 
[INFO] console-testsuite/basic                    RUNNING
[INFO] console-testsuite/basic                    SUCCESS (0:02:08.014) 
[INFO] corba-testsuite/corba-helloworld           RUNNING
[INFO] corba-testsuite/corba-helloworld           SUCCESS (0:00:58.642) 
[INFO] corba-testsuite/corba-marshal              RUNNING
[INFO] corba-testsuite/corba-marshal              SUCCESS (0:01:14.281) 
[INFO] corba-testsuite/corba-mytime               RUNNING
[INFO] corba-testsuite/corba-mytime               SUCCESS (0:00:53.986) 
[INFO] deployment-testsuite/deployment-tests      RUNNING
[INFO] deployment-testsuite/deployment-tests      SUCCESS (0:00:39.050) 
[INFO] deployment-testsuite/jca-cms-tests         RUNNING
[INFO] deployment-testsuite/jca-cms-tests         SUCCESS (0:00:36.826) 
[INFO] deployment-testsuite/manifestcp-tests      RUNNING
[INFO] deployment-testsuite/manifestcp-tests      SUCCESS (0:00:41.341) 
[INFO] enterprise-testsuite/ejb-tests             RUNNING
[INFO] enterprise-testsuite/ejb-tests             SUCCESS (0:01:46.541) 
[INFO] enterprise-testsuite/jms-tests             RUNNING
[INFO] enterprise-testsuite/jms-tests             FAILURE (0:01:22.741) Java returned: 1
[INFO] enterprise-testsuite/jpa-tests             RUNNING
[INFO] enterprise-testsuite/jpa-tests             SUCCESS (0:00:58.819) 
[INFO] enterprise-testsuite/sec-client-tests      RUNNING
[INFO] enterprise-testsuite/sec-client-tests      SUCCESS (0:00:34.777) 
[INFO] enterprise-testsuite/sec-tests             RUNNING
[INFO] enterprise-testsuite/sec-tests             SUCCESS (0:01:02.576) 
[INFO] security-testsuite/test-security           RUNNING
[INFO] security-testsuite/test-security           SUCCESS (0:00:58.069) 
[INFO] web-testsuite/test-2.1-jsps                RUNNING
[INFO] web-testsuite/test-2.1-jsps                SUCCESS (0:00:37.491) 
[INFO] web-testsuite/test-2.5-servlets            RUNNING
[INFO] web-testsuite/test-2.5-servlets            SUCCESS (0:00:34.810) 
[INFO] web-testsuite/test-myfaces                 RUNNING
[INFO] web-testsuite/test-myfaces                 SUCCESS (0:00:37.557) 
[INFO] web-testsuite/test-tomcat                  RUNNING
[INFO] web-testsuite/test-tomcat                  SUCCESS (0:00:28.156) 
[INFO] web-testsuite/test-web-forward             RUNNING
[INFO] web-testsuite/test-web-forward             SUCCESS (0:00:43.365) 
[INFO] web-testsuite/test-web-references          RUNNING
[INFO] web-testsuite/test-web-references          SUCCESS (0:00:50.188) 
[INFO] webservices-testsuite/jaxb-tests           RUNNING
[INFO] webservices-testsuite/jaxb-tests           SUCCESS (0:01:09.550) 
[INFO] webservices-testsuite/jaxr-tests           RUNNING
[INFO] webservices-testsuite/jaxr-tests           SUCCESS (0:01:10.548) 
[INFO] webservices-testsuite/jaxrpc-jaxws-tests   RUNNING
[INFO] webservices-testsuite/jaxrpc-jaxws-tests   SUCCESS (0:00:40.584) 
[INFO] webservices-testsuite/jaxrpc-tests         RUNNING
[INFO] webservices-testsuite/jaxrpc-tests         SUCCESS (0:00:58.176) 
[INFO] webservices-testsuite/jaxws-catalog-tests  RUNNING
[INFO] webservices-testsuite/jaxws-catalog-tests  SUCCESS (0:01:00.369) 
[INFO] webservices-testsuite/jaxws-mtom-tests     RUNNING
[INFO] webservices-testsuite/jaxws-mtom-tests     SUCCESS (0:00:57.048) 
[INFO] webservices-testsuite/jaxws-provider-tests RUNNING
[INFO] webservices-testsuite/jaxws-provider-tests SUCCESS (0:00:54.157) 
[INFO] webservices-testsuite/jaxws-tests          RUNNING
[INFO] webservices-testsuite/jaxws-tests          SUCCESS (0:02:21.658) 
[INFO] webservices-testsuite/jaxws-wsa-tests      RUNNING
[INFO] webservices-testsuite/jaxws-wsa-tests      SUCCESS (0:00:58.746) 
[INFO] webservices-testsuite/saaj-tests           RUNNING
[INFO] webservices-testsuite/saaj-tests           SUCCESS (0:00:45.878) 
[INFO] webservices-testsuite/stax-tests           RUNNING
[INFO] webservices-testsuite/stax-tests           SUCCESS (0:01:12.103) 
[INFO] 
[INFO] -------------------------------------------------------------------------------
[INFO] Test Summary (0:41:36.511)
[INFO]     Passed: 35
[INFO]     Failed: 1
[INFO] -------------------------------------------------------------------------------
[INFO] 
[INFO] The following tests failed:
[INFO]     * enterprise-testsuite/jms-tests - /home/geronimo/geronimo/2.2/testsuite/enterprise-testsuite/jms-tests/build.log
[INFO] 
[INFO] ------------------------------------------------------------------------
[ERROR] BUILD ERROR
 
Assembly: jetty
=================================
See full test results and logs at http://people.apache.org/builds/geronimo/server/binaries/2.2/20090827/logs-2000-jetty/
 
 
[INFO] snapshot org.apache.geronimo.assemblies:geronimo-jetty7-javaee5:2.2-SNAPSHOT: checking
for updates from apache.snapshots
[INFO] Using assembly artifact: org.apache.geronimo.assemblies:geronimo-jetty7-javaee5:zip:bin:2.2-SNAPSHOT:provided
[INFO] Using geronimoHome: /home/geronimo/geronimo/2.2/testsuite/target/geronimo-jetty7-javaee5-2.2-SNAPSHOT
[INFO] Installing assembly...
[INFO] Expanding: /home/geronimo/.m2/repository/org/apache/geronimo/assemblies/geronimo-jetty7-javaee5/2.2-SNAPSHOT/geronimo-jetty7-javaee5-2.2-SNAPSHOT-bin.zip
into /home/geronimo/geronimo/2.2/testsuite/target
[INFO] Starting Geronimo server...
[INFO] Selected option set: default
[INFO] Redirecting output to: /home/geronimo/geronimo/2.2/testsuite/target/geronimo-logs/org.apache.geronimo.mavenplugins.geronimo.server.StartServerMojo.log
[INFO] Waiting for Geronimo server...
[INFO] Geronimo server started in 0:00:49.930
[INFO] [shitty:install {execution: default}]
[INFO] Installing /home/geronimo/geronimo/2.2/testsuite/pom.xml to /home/geronimo/.m2/repository/org/apache/geronimo/testsuite/testsuite/testing/testsuite-testing.pom
[INFO] [shitty:test {execution: default}]
[INFO] Starting 36 test builds
[INFO] 
[INFO] -------------------------------------------------------------------------------
[INFO] 
[INFO] commands-testsuite/deploy                  RUNNING
[INFO] commands-testsuite/deploy                  SUCCESS (0:01:20.293) 
[INFO] commands-testsuite/gshell                  RUNNING
[INFO] commands-testsuite/gshell                  SUCCESS (0:00:40.119) 
[INFO] commands-testsuite/jaxws                   RUNNING
[INFO] commands-testsuite/jaxws                   SUCCESS (0:00:45.899) 
[INFO] commands-testsuite/shutdown                RUNNING
[INFO] commands-testsuite/shutdown                SUCCESS (0:00:24.004) 
[INFO] concurrent-testsuite/concurrent-basic      RUNNING
[INFO] concurrent-testsuite/concurrent-basic      SUCCESS (0:06:30.472) 
[INFO] console-testsuite/advanced                 RUNNING
[INFO] console-testsuite/advanced                 SUCCESS (0:01:40.230) 
[INFO] console-testsuite/basic                    RUNNING
[INFO] console-testsuite/basic                    SUCCESS (0:02:14.722) 
[INFO] corba-testsuite/corba-helloworld           RUNNING
[INFO] corba-testsuite/corba-helloworld           SUCCESS (0:00:58.054) 
[INFO] corba-testsuite/corba-marshal              RUNNING
[INFO] corba-testsuite/corba-marshal              SUCCESS (0:01:00.927) 
[INFO] corba-testsuite/corba-mytime               RUNNING
[INFO] corba-testsuite/corba-mytime               SUCCESS (0:00:52.234) 
[INFO] deployment-testsuite/deployment-tests      RUNNING
[INFO] deployment-testsuite/deployment-tests      SUCCESS (0:00:38.661) 
[INFO] deployment-testsuite/jca-cms-tests         RUNNING
[INFO] deployment-testsuite/jca-cms-tests         SUCCESS (0:00:33.587) 
[INFO] deployment-testsuite/manifestcp-tests      RUNNING
[INFO] deployment-testsuite/manifestcp-tests      SUCCESS (0:00:40.959) 
[INFO] enterprise-testsuite/ejb-tests             RUNNING
[INFO] enterprise-testsuite/ejb-tests             SUCCESS (0:00:54.811) 
[INFO] enterprise-testsuite/jms-tests             RUNNING
[INFO] enterprise-testsuite/jms-tests             FAILURE (0:01:19.317) Java returned: 1
[INFO] enterprise-testsuite/jpa-tests             RUNNING
[INFO] enterprise-testsuite/jpa-tests             SUCCESS (0:00:51.134) 
[INFO] enterprise-testsuite/sec-client-tests      RUNNING
[INFO] enterprise-testsuite/sec-client-tests      SUCCESS (0:00:36.800) 
[INFO] enterprise-testsuite/sec-tests             RUNNING
[INFO] enterprise-testsuite/sec-tests             SUCCESS (0:00:59.882) 
[INFO] security-testsuite/test-security           RUNNING
[INFO] security-testsuite/test-security           SUCCESS (0:00:58.742) 
[INFO] web-testsuite/test-2.1-jsps                RUNNING
[INFO] web-testsuite/test-2.1-jsps                SUCCESS (0:00:36.760) 
[INFO] web-testsuite/test-2.5-servlets            RUNNING
[INFO] web-testsuite/test-2.5-servlets            SUCCESS (0:00:36.222) 
[INFO] web-testsuite/test-jetty                   RUNNING
[INFO] web-testsuite/test-jetty                   SUCCESS (0:00:28.928) 
[INFO] web-testsuite/test-myfaces                 RUNNING
[INFO] web-testsuite/test-myfaces                 SUCCESS (0:00:37.557) 
[INFO] web-testsuite/test-web-forward             RUNNING
[INFO] web-testsuite/test-web-forward             SUCCESS (0:00:44.288) 
[INFO] web-testsuite/test-web-references          RUNNING
[INFO] web-testsuite/test-web-references          SUCCESS (0:00:49.875) 
[INFO] webservices-testsuite/jaxb-tests           RUNNING
[INFO] webservices-testsuite/jaxb-tests           SUCCESS (0:01:10.741) 
[INFO] webservices-testsuite/jaxr-tests           RUNNING
[INFO] webservices-testsuite/jaxr-tests           SUCCESS (0:01:10.767) 
[INFO] webservices-testsuite/jaxrpc-jaxws-tests   RUNNING
[INFO] webservices-testsuite/jaxrpc-jaxws-tests   SUCCESS (0:00:35.427) 
[INFO] webservices-testsuite/jaxrpc-tests         RUNNING
[INFO] webservices-testsuite/jaxrpc-tests         SUCCESS (0:00:57.984) 
[INFO] webservices-testsuite/jaxws-catalog-tests  RUNNING
[INFO] webservices-testsuite/jaxws-catalog-tests  SUCCESS (0:00:57.730) 
[INFO] webservices-testsuite/jaxws-mtom-tests     RUNNING
[INFO] webservices-testsuite/jaxws-mtom-tests     SUCCESS (0:00:49.810) 
[INFO] webservices-testsuite/jaxws-provider-tests RUNNING
[INFO] webservices-testsuite/jaxws-provider-tests SUCCESS (0:00:55.231) 
[INFO] webservices-testsuite/jaxws-tests          RUNNING
[INFO] webservices-testsuite/jaxws-tests          SUCCESS (0:02:06.747) 
[INFO] webservices-testsuite/jaxws-wsa-tests      RUNNING
[INFO] webservices-testsuite/jaxws-wsa-tests      SUCCESS (0:00:51.162) 
[INFO] webservices-testsuite/saaj-tests           RUNNING
[INFO] webservices-testsuite/saaj-tests           SUCCESS (0:00:47.057) 
[INFO] webservices-testsuite/stax-tests           RUNNING
[INFO] webservices-testsuite/stax-tests           SUCCESS (0:01:10.992) 
[INFO] 
[INFO] -------------------------------------------------------------------------------
[INFO] Test Summary (0:39:28.353)
[INFO]     Passed: 35
[INFO]     Failed: 1
[INFO] -------------------------------------------------------------------------------
[INFO] 
[INFO] The following tests failed:
[INFO]     * enterprise-testsuite/jms-tests - /home/geronimo/geronimo/2.2/testsuite/enterprise-testsuite/jms-tests/build.log
[INFO] 
[INFO] ------------------------------------------------------------------------
[ERROR] BUILD ERROR
 
Samples: branches/2.2
=================================
Log: http://people.apache.org/builds/geronimo/server/binaries/2.2/20090827/samples-2000.log
 
Build status: OK
 

Mime
View raw message