geronimo-dev mailing list archives

Site index · List index
Message view « Date » · « Thread »
Top « Date » · « Thread »
From ga...@apache.org
Subject [BUILD] trunk: Failed for Revision: 808160
Date Wed, 26 Aug 2009 20:51:35 GMT
Geronimo Revision: 808160 built with tests included
 
See the full build-1500.log file at http://people.apache.org/builds/geronimo/server/binaries/trunk/20090826/build-1500.log
 
Download the binaries from http://people.apache.org/builds/geronimo/server/binaries/trunk/20090826
[INFO] BUILD SUCCESSFUL
[INFO] ------------------------------------------------------------------------
[INFO] Total time: 41 minutes 7 seconds
[INFO] Finished at: Wed Aug 26 15:44:14 EDT 2009
[INFO] Final Memory: 685M/922M
[INFO] ------------------------------------------------------------------------
 
TESTSUITE RESULTS (Failures only)
=================================
 
Assembly: tomcat
=================================
See full test results and logs at http://people.apache.org/builds/geronimo/server/binaries/trunk/20090826/logs-1500-tomcat/
 
 
[INFO] [shitty:test {execution: default}]
[INFO] Starting 36 test builds
[INFO] 
[INFO] -------------------------------------------------------------------------------
[INFO] 
[INFO] commands-testsuite/deploy                  RUNNING
[INFO] commands-testsuite/deploy                  SUCCESS (0:01:03.429) 
[INFO] commands-testsuite/gshell                  RUNNING
[INFO] commands-testsuite/gshell                  FAILURE (0:00:18.591) Java returned: 1
[INFO] commands-testsuite/jaxws                   RUNNING
[INFO] commands-testsuite/jaxws                   FAILURE (0:00:32.702) Java returned: 1
[INFO] commands-testsuite/shutdown                RUNNING
[INFO] commands-testsuite/shutdown                SUCCESS (0:00:20.697) 
[INFO] concurrent-testsuite/concurrent-basic      RUNNING
[INFO] concurrent-testsuite/concurrent-basic      FAILURE (0:00:05.241) Java returned: 1
[INFO] console-testsuite/advanced                 RUNNING
[INFO] console-testsuite/advanced                 SUCCESS (0:01:33.090) 
[INFO] console-testsuite/basic                    RUNNING
[INFO] console-testsuite/basic                    SUCCESS (0:01:59.943) 
[INFO] corba-testsuite/corba-helloworld           RUNNING
[INFO] corba-testsuite/corba-helloworld           FAILURE (0:00:47.603) Java returned: 1
[INFO] corba-testsuite/corba-marshal              RUNNING
[INFO] corba-testsuite/corba-marshal              FAILURE (0:00:02.056) Java returned: 1
[INFO] corba-testsuite/corba-mytime               RUNNING
[INFO] corba-testsuite/corba-mytime               SUCCESS (0:00:57.151) 
[INFO] deployment-testsuite/deployment-tests      RUNNING
[INFO] deployment-testsuite/deployment-tests      SUCCESS (0:00:33.190) 
[INFO] deployment-testsuite/jca-cms-tests         RUNNING
[INFO] deployment-testsuite/jca-cms-tests         SUCCESS (0:00:37.274) 
[INFO] deployment-testsuite/manifestcp-tests      RUNNING
[INFO] deployment-testsuite/manifestcp-tests      SUCCESS (0:00:40.447) 
[INFO] enterprise-testsuite/ejb-tests             RUNNING
[INFO] enterprise-testsuite/ejb-tests             FAILURE (0:00:01.070) Java returned: 1
[INFO] enterprise-testsuite/jms-tests             RUNNING
[INFO] enterprise-testsuite/jms-tests             FAILURE (0:01:02.285) Java returned: 1
[INFO] enterprise-testsuite/jpa-tests             RUNNING
[INFO] enterprise-testsuite/jpa-tests             FAILURE (0:00:02.012) Java returned: 1
[INFO] enterprise-testsuite/sec-client-tests      RUNNING
[INFO] enterprise-testsuite/sec-client-tests      SUCCESS (0:00:29.527) 
[INFO] enterprise-testsuite/sec-tests             RUNNING
[INFO] enterprise-testsuite/sec-tests             SUCCESS (0:01:05.495) 
[INFO] security-testsuite/test-security           RUNNING
[INFO] security-testsuite/test-security           SUCCESS (0:00:53.741) 
[INFO] web-testsuite/test-2.1-jsps                RUNNING
[INFO] web-testsuite/test-2.1-jsps                SUCCESS (0:00:34.183) 
[INFO] web-testsuite/test-2.5-servlets            RUNNING
[INFO] web-testsuite/test-2.5-servlets            SUCCESS (0:00:35.003) 
[INFO] web-testsuite/test-myfaces                 RUNNING
[INFO] web-testsuite/test-myfaces                 SUCCESS (0:00:34.906) 
[INFO] web-testsuite/test-tomcat                  RUNNING
[INFO] web-testsuite/test-tomcat                  SUCCESS (0:00:25.215) 
[INFO] web-testsuite/test-web-forward             RUNNING
[INFO] web-testsuite/test-web-forward             SUCCESS (0:00:44.338) 
[INFO] web-testsuite/test-web-references          RUNNING
[INFO] web-testsuite/test-web-references          FAILURE (0:00:02.681) Java returned: 1
[INFO] webservices-testsuite/jaxb-tests           RUNNING
[INFO] webservices-testsuite/jaxb-tests           SUCCESS (0:01:05.417) 
[INFO] webservices-testsuite/jaxr-tests           RUNNING
[INFO] webservices-testsuite/jaxr-tests           SUCCESS (0:01:06.237) 
[INFO] webservices-testsuite/jaxrpc-jaxws-tests   RUNNING
[INFO] webservices-testsuite/jaxrpc-jaxws-tests   FAILURE (0:00:25.967) Java returned: 1
[INFO] webservices-testsuite/jaxrpc-tests         RUNNING
[INFO] webservices-testsuite/jaxrpc-tests         SUCCESS (0:00:51.552) 
[INFO] webservices-testsuite/jaxws-catalog-tests  RUNNING
[INFO] webservices-testsuite/jaxws-catalog-tests  SUCCESS (0:00:56.485) 
[INFO] webservices-testsuite/jaxws-mtom-tests     RUNNING
[INFO] webservices-testsuite/jaxws-mtom-tests     FAILURE (0:00:38.856) Java returned: 1
[INFO] webservices-testsuite/jaxws-provider-tests RUNNING
[INFO] webservices-testsuite/jaxws-provider-tests SUCCESS (0:01:12.032) 
[INFO] webservices-testsuite/jaxws-tests          RUNNING
[INFO] webservices-testsuite/jaxws-tests          FAILURE (0:00:28.232) Java returned: 1
[INFO] webservices-testsuite/jaxws-wsa-tests      RUNNING
[INFO] webservices-testsuite/jaxws-wsa-tests      FAILURE (0:00:38.566) Java returned: 1
[INFO] webservices-testsuite/saaj-tests           RUNNING
[INFO] webservices-testsuite/saaj-tests           SUCCESS (0:00:41.647) 
[INFO] webservices-testsuite/stax-tests           RUNNING
[INFO] webservices-testsuite/stax-tests           SUCCESS (0:01:04.356) 
[INFO] 
[INFO] -------------------------------------------------------------------------------
[INFO] Test Summary (0:25:11.671)
[INFO]     Passed: 23
[INFO]     Failed: 13
[INFO] -------------------------------------------------------------------------------
[INFO] 
[INFO] The following tests failed:
[INFO]     * commands-testsuite/gshell - /home/geronimo/geronimo/trunk/testsuite/commands-testsuite/gshell/build.log
[INFO]     * commands-testsuite/jaxws - /home/geronimo/geronimo/trunk/testsuite/commands-testsuite/jaxws/build.log
[INFO]     * concurrent-testsuite/concurrent-basic - /home/geronimo/geronimo/trunk/testsuite/concurrent-testsuite/concurrent-basic/build.log
[INFO]     * corba-testsuite/corba-helloworld - /home/geronimo/geronimo/trunk/testsuite/corba-testsuite/corba-helloworld/build.log
[INFO]     * corba-testsuite/corba-marshal - /home/geronimo/geronimo/trunk/testsuite/corba-testsuite/corba-marshal/build.log
[INFO]     * enterprise-testsuite/ejb-tests - /home/geronimo/geronimo/trunk/testsuite/enterprise-testsuite/ejb-tests/build.log
[INFO]     * enterprise-testsuite/jms-tests - /home/geronimo/geronimo/trunk/testsuite/enterprise-testsuite/jms-tests/build.log
[INFO]     * enterprise-testsuite/jpa-tests - /home/geronimo/geronimo/trunk/testsuite/enterprise-testsuite/jpa-tests/build.log
[INFO]     * web-testsuite/test-web-references - /home/geronimo/geronimo/trunk/testsuite/web-testsuite/test-web-references/build.log
[INFO]     * webservices-testsuite/jaxrpc-jaxws-tests - /home/geronimo/geronimo/trunk/testsuite/webservices-testsuite/jaxrpc-jaxws-tests/build.log
[INFO]     * webservices-testsuite/jaxws-mtom-tests - /home/geronimo/geronimo/trunk/testsuite/webservices-testsuite/jaxws-mtom-tests/build.log
[INFO]     * webservices-testsuite/jaxws-tests - /home/geronimo/geronimo/trunk/testsuite/webservices-testsuite/jaxws-tests/build.log
[INFO]     * webservices-testsuite/jaxws-wsa-tests - /home/geronimo/geronimo/trunk/testsuite/webservices-testsuite/jaxws-wsa-tests/build.log
[INFO] 
[INFO] ------------------------------------------------------------------------
[ERROR] BUILD ERROR
 
Assembly: jetty
=================================
See full test results and logs at http://people.apache.org/builds/geronimo/server/binaries/trunk/20090826/logs-1500-jetty/
 
 
[INFO] [shitty:test {execution: default}]
[INFO] Starting 36 test builds
[INFO] 
[INFO] -------------------------------------------------------------------------------
[INFO] 
[INFO] commands-testsuite/deploy                  RUNNING
[INFO] commands-testsuite/deploy                  SUCCESS (0:01:01.172) 
[INFO] commands-testsuite/gshell                  RUNNING
[INFO] commands-testsuite/gshell                  FAILURE (0:00:18.947) Java returned: 1
[INFO] commands-testsuite/jaxws                   RUNNING
[INFO] commands-testsuite/jaxws                   FAILURE (0:00:30.704) Java returned: 1
[INFO] commands-testsuite/shutdown                RUNNING
[INFO] commands-testsuite/shutdown                SUCCESS (0:00:20.998) 
[INFO] concurrent-testsuite/concurrent-basic      RUNNING
[INFO] concurrent-testsuite/concurrent-basic      FAILURE (0:00:05.184) Java returned: 1
[INFO] console-testsuite/advanced                 RUNNING
[INFO] console-testsuite/advanced                 FAILURE (0:00:20.089) Java returned: 1
[INFO] console-testsuite/basic                    RUNNING
[INFO] console-testsuite/basic                    FAILURE (0:00:22.879) Java returned: 1
[INFO] corba-testsuite/corba-helloworld           RUNNING
[INFO] corba-testsuite/corba-helloworld           FAILURE (0:00:47.485) Java returned: 1
[INFO] corba-testsuite/corba-marshal              RUNNING
[INFO] corba-testsuite/corba-marshal              FAILURE (0:00:01.943) Java returned: 1
[INFO] corba-testsuite/corba-mytime               RUNNING
[INFO] corba-testsuite/corba-mytime               SUCCESS (0:00:57.839) 
[INFO] deployment-testsuite/deployment-tests      RUNNING
[INFO] deployment-testsuite/deployment-tests      SUCCESS (0:00:35.057) 
[INFO] deployment-testsuite/jca-cms-tests         RUNNING
[INFO] deployment-testsuite/jca-cms-tests         SUCCESS (0:00:33.588) 
[INFO] deployment-testsuite/manifestcp-tests      RUNNING
[INFO] deployment-testsuite/manifestcp-tests      SUCCESS (0:00:41.033) 
[INFO] enterprise-testsuite/ejb-tests             RUNNING
[INFO] enterprise-testsuite/ejb-tests             FAILURE (0:00:01.004) Java returned: 1
[INFO] enterprise-testsuite/jms-tests             RUNNING
[INFO] enterprise-testsuite/jms-tests             FAILURE (0:00:39.530) Java returned: 1
[INFO] enterprise-testsuite/jpa-tests             RUNNING
[INFO] enterprise-testsuite/jpa-tests             FAILURE (0:00:01.959) Java returned: 1
[INFO] enterprise-testsuite/sec-client-tests      RUNNING
[INFO] enterprise-testsuite/sec-client-tests      SUCCESS (0:00:30.571) 
[INFO] enterprise-testsuite/sec-tests             RUNNING
[INFO] enterprise-testsuite/sec-tests             FAILURE (0:01:00.013) Java returned: 1
[INFO] security-testsuite/test-security           RUNNING
[INFO] security-testsuite/test-security           FAILURE (0:00:48.995) Java returned: 1
[INFO] web-testsuite/test-2.1-jsps                RUNNING
[INFO] web-testsuite/test-2.1-jsps                SUCCESS (0:00:35.392) 
[INFO] web-testsuite/test-2.5-servlets            RUNNING
[INFO] web-testsuite/test-2.5-servlets            SUCCESS (0:00:36.515) 
[INFO] web-testsuite/test-jetty                   RUNNING
[INFO] web-testsuite/test-jetty                   SUCCESS (0:00:25.311) 
[INFO] web-testsuite/test-myfaces                 RUNNING
[INFO] web-testsuite/test-myfaces                 SUCCESS (0:00:34.866) 
[INFO] web-testsuite/test-web-forward             RUNNING
[INFO] web-testsuite/test-web-forward             SUCCESS (0:00:45.493) 
[INFO] web-testsuite/test-web-references          RUNNING
[INFO] web-testsuite/test-web-references          FAILURE (0:00:02.677) Java returned: 1
[INFO] webservices-testsuite/jaxb-tests           RUNNING
[INFO] webservices-testsuite/jaxb-tests           SUCCESS (0:01:06.089) 
[INFO] webservices-testsuite/jaxr-tests           RUNNING
[INFO] webservices-testsuite/jaxr-tests           SUCCESS (0:01:06.698) 
[INFO] webservices-testsuite/jaxrpc-jaxws-tests   RUNNING
[INFO] webservices-testsuite/jaxrpc-jaxws-tests   SUCCESS (0:00:34.809) 
[INFO] webservices-testsuite/jaxrpc-tests         RUNNING
[INFO] webservices-testsuite/jaxrpc-tests         SUCCESS (0:00:54.831) 
[INFO] webservices-testsuite/jaxws-catalog-tests  RUNNING
[INFO] webservices-testsuite/jaxws-catalog-tests  SUCCESS (0:00:55.885) 
[INFO] webservices-testsuite/jaxws-mtom-tests     RUNNING
[INFO] webservices-testsuite/jaxws-mtom-tests     SUCCESS (0:00:50.903) 
[INFO] webservices-testsuite/jaxws-provider-tests RUNNING
[INFO] webservices-testsuite/jaxws-provider-tests SUCCESS (0:01:13.254) 
[INFO] webservices-testsuite/jaxws-tests          RUNNING
[INFO] webservices-testsuite/jaxws-tests          SUCCESS (0:01:55.023) 
[INFO] webservices-testsuite/jaxws-wsa-tests      RUNNING
[INFO] webservices-testsuite/jaxws-wsa-tests      SUCCESS (0:00:51.628) 
[INFO] webservices-testsuite/saaj-tests           RUNNING
[INFO] webservices-testsuite/saaj-tests           SUCCESS (0:00:42.569) 
[INFO] webservices-testsuite/stax-tests           RUNNING
[INFO] webservices-testsuite/stax-tests           SUCCESS (0:01:06.835) 
[INFO] 
[INFO] -------------------------------------------------------------------------------
[INFO] Test Summary (0:23:57.960)
[INFO]     Passed: 23
[INFO]     Failed: 13
[INFO] -------------------------------------------------------------------------------
[INFO] 
[INFO] The following tests failed:
[INFO]     * commands-testsuite/gshell - /home/geronimo/geronimo/trunk/testsuite/commands-testsuite/gshell/build.log
[INFO]     * commands-testsuite/jaxws - /home/geronimo/geronimo/trunk/testsuite/commands-testsuite/jaxws/build.log
[INFO]     * concurrent-testsuite/concurrent-basic - /home/geronimo/geronimo/trunk/testsuite/concurrent-testsuite/concurrent-basic/build.log
[INFO]     * console-testsuite/advanced - /home/geronimo/geronimo/trunk/testsuite/console-testsuite/advanced/build.log
[INFO]     * console-testsuite/basic - /home/geronimo/geronimo/trunk/testsuite/console-testsuite/basic/build.log
[INFO]     * corba-testsuite/corba-helloworld - /home/geronimo/geronimo/trunk/testsuite/corba-testsuite/corba-helloworld/build.log
[INFO]     * corba-testsuite/corba-marshal - /home/geronimo/geronimo/trunk/testsuite/corba-testsuite/corba-marshal/build.log
[INFO]     * enterprise-testsuite/ejb-tests - /home/geronimo/geronimo/trunk/testsuite/enterprise-testsuite/ejb-tests/build.log
[INFO]     * enterprise-testsuite/jms-tests - /home/geronimo/geronimo/trunk/testsuite/enterprise-testsuite/jms-tests/build.log
[INFO]     * enterprise-testsuite/jpa-tests - /home/geronimo/geronimo/trunk/testsuite/enterprise-testsuite/jpa-tests/build.log
[INFO]     * enterprise-testsuite/sec-tests - /home/geronimo/geronimo/trunk/testsuite/enterprise-testsuite/sec-tests/build.log
[INFO]     * security-testsuite/test-security - /home/geronimo/geronimo/trunk/testsuite/security-testsuite/test-security/build.log
[INFO]     * web-testsuite/test-web-references - /home/geronimo/geronimo/trunk/testsuite/web-testsuite/test-web-references/build.log
[INFO] 
[INFO] ------------------------------------------------------------------------
[ERROR] BUILD ERROR
 
Samples: trunk
=================================
Log: http://people.apache.org/builds/geronimo/server/binaries/trunk/20090826/samples-1500.log
 
Build status: FAILED
 

Mime
View raw message