geronimo-dev mailing list archives

Site index · List index
Message view « Date » · « Thread »
Top « Date » · « Thread »
From ga...@apache.org
Subject [BUILD] branches/2.1: Failed for Revision: 800727
Date Tue, 04 Aug 2009 11:12:22 GMT
Geronimo Revision: 800727 built with tests included
 
See the full build-0800.log file at http://people.apache.org/builds/geronimo/server/binaries/2.1/20090804/build-0800.log
 
 
See the unit test reports at http://people.apache.org/builds/geronimo/server/binaries/2.1/20090804/unit-test-reports
 
INFO: Built File: /WEB-INF/view/jmsmanager/activemq/help.jsp
Aug 4, 2009 8:22:11 AM org.apache.jasper.JspC processFile
INFO: Built File: /WEB-INF/view/jmsmanager/activemq/config.jsp
Aug 4, 2009 8:22:11 AM org.apache.jasper.JspC processFile
INFO: Built File: /WEB-INF/view/jmsmanager/activemq/addACF.jsp
Aug 4, 2009 8:22:12 AM org.apache.jasper.JspC processFile
INFO: Built File: /WEB-INF/view/jmsmanager/server/maximized.jsp
Aug 4, 2009 8:22:12 AM org.apache.jasper.JspC processFile
INFO: Built File: /WEB-INF/view/jmsmanager/server/normal.jsp
Aug 4, 2009 8:22:12 AM org.apache.jasper.JspC processFile
INFO: Built File: /WEB-INF/view/jmsmanager/server/help.jsp
Aug 4, 2009 8:22:12 AM org.apache.jasper.JspC processFile
INFO: Built File: /WEB-INF/view/jmsmanager/server/connector/editGeneric.jsp
Aug 4, 2009 8:22:13 AM org.apache.jasper.JspC processFile
INFO: Built File: /WEB-INF/view/jmsmanager/server/connector/maximized.jsp
Aug 4, 2009 8:22:13 AM org.apache.jasper.JspC processFile
INFO: Built File: /WEB-INF/view/jmsmanager/server/connector/normal.jsp
Aug 4, 2009 8:22:13 AM org.apache.jasper.JspC processFile
INFO: Built File: /WEB-INF/view/jmsmanager/server/connector/help.jsp
[INFO] Compiled completed in 0:00:10.618
[INFO] Copying 29 files to /home/geronimo/geronimo/2.1/plugins/activemq/activemq-portlets/target/classes
[INFO] [resources:testResources]
[INFO] Using default encoding to copy filtered resources.
[INFO] [compiler:testCompile]
[INFO] No sources to compile
[INFO] [surefire:test]
[INFO] No tests to run.
[INFO] [war:war]
[INFO] Exploding webapp...
[INFO] Assembling webapp activemq-portlets in /home/geronimo/geronimo/2.1/plugins/activemq/activemq-portlets/target/activemq-portlets-2.1.5-SNAPSHOT
[INFO] Copy webapp webResources to /home/geronimo/geronimo/2.1/plugins/activemq/activemq-portlets/target/activemq-portlets-2.1.5-SNAPSHOT
[INFO] Copy webapp webResources to /home/geronimo/geronimo/2.1/plugins/activemq/activemq-portlets/target/activemq-portlets-2.1.5-SNAPSHOT
[INFO] Building jar: /home/geronimo/geronimo/2.1/plugins/activemq/activemq-portlets/target/activemq-portlets-2.1.5-SNAPSHOT/WEB-INF/lib/activemq-portlets-2.1.5-SNAPSHOT.jar
[INFO] Generating war /home/geronimo/geronimo/2.1/plugins/activemq/activemq-portlets/target/activemq-portlets-2.1.5-SNAPSHOT.war
[INFO] Building war: /home/geronimo/geronimo/2.1/plugins/activemq/activemq-portlets/target/activemq-portlets-2.1.5-SNAPSHOT.war
[INFO] [tools:verify-legal-files {execution: verify-legal-files}]
[INFO] Checking legal files in: activemq-portlets-2.1.5-SNAPSHOT.war
[INFO] [install:install]
[INFO] Installing /home/geronimo/geronimo/2.1/plugins/activemq/activemq-portlets/target/activemq-portlets-2.1.5-SNAPSHOT.war
to /home/geronimo/.m2/repository/org/apache/geronimo/plugins/activemq-portlets/2.1.5-SNAPSHOT/activemq-portlets-2.1.5-SNAPSHOT.war
[INFO] ------------------------------------------------------------------------
[INFO] Building Geronimo Plugins, Console :: XSSXSRF Filter
[INFO]    task-segment: [install]
[INFO] ------------------------------------------------------------------------
[INFO] [enforcer:enforce {execution: default}]
[INFO] [tools:copy-legal-files {execution: install-legal-files}]
[INFO] Created dir: /home/geronimo/geronimo/2.1/plugins/console/console-filter/target/classes/META-INF
[INFO] Copying 2 files to /home/geronimo/geronimo/2.1/plugins/console/console-filter/target/classes/META-INF
[INFO] [resources:resources]
[INFO] Using default encoding to copy filtered resources.
[INFO] [compiler:compile]
[INFO] Compiling 5 source files to /home/geronimo/geronimo/2.1/plugins/console/console-filter/target/classes
[INFO] ------------------------------------------------------------------------
[ERROR] BUILD FAILURE
[INFO] ------------------------------------------------------------------------
[INFO] Compilation failure

/home/geronimo/geronimo/2.1/plugins/console/console-filter/src/main/java/org/apache/geronimo/console/filter/FilterResponseWrapper.java:[32,17]
package org.slf4j does not exist

/home/geronimo/geronimo/2.1/plugins/console/console-filter/src/main/java/org/apache/geronimo/console/filter/FilterResponseWrapper.java:[33,17]
package org.slf4j does not exist

/home/geronimo/geronimo/2.1/plugins/console/console-filter/src/main/java/org/apache/geronimo/console/filter/FilterResponseWrapper.java:[43,29]
cannot find symbol
symbol  : class Logger
location: class org.apache.geronimo.console.filter.FilterResponseWrapper

/home/geronimo/geronimo/2.1/plugins/console/console-filter/src/main/java/org/apache/geronimo/console/filter/FilterResponseWrapper.java:[43,42]
cannot find symbol
symbol  : variable LoggerFactory
location: class org.apache.geronimo.console.filter.FilterResponseWrapper


[INFO] ------------------------------------------------------------------------
[INFO] Trace
org.apache.maven.BuildFailureException: Compilation failure
	at org.apache.maven.lifecycle.DefaultLifecycleExecutor.executeGoals(DefaultLifecycleExecutor.java:579)
	at org.apache.maven.lifecycle.DefaultLifecycleExecutor.executeGoalWithLifecycle(DefaultLifecycleExecutor.java:499)
	at org.apache.maven.lifecycle.DefaultLifecycleExecutor.executeGoal(DefaultLifecycleExecutor.java:478)
	at org.apache.maven.lifecycle.DefaultLifecycleExecutor.executeGoalAndHandleFailures(DefaultLifecycleExecutor.java:330)
	at org.apache.maven.lifecycle.DefaultLifecycleExecutor.executeTaskSegments(DefaultLifecycleExecutor.java:291)
	at org.apache.maven.lifecycle.DefaultLifecycleExecutor.execute(DefaultLifecycleExecutor.java:142)
	at org.apache.maven.DefaultMaven.doExecute(DefaultMaven.java:336)
	at org.apache.maven.DefaultMaven.execute(DefaultMaven.java:129)
	at org.apache.maven.cli.MavenCli.main(MavenCli.java:287)
	at sun.reflect.NativeMethodAccessorImpl.invoke0(Native Method)
	at sun.reflect.NativeMethodAccessorImpl.invoke(NativeMethodAccessorImpl.java:39)
	at sun.reflect.DelegatingMethodAccessorImpl.invoke(DelegatingMethodAccessorImpl.java:25)
	at java.lang.reflect.Method.invoke(Method.java:585)
	at org.codehaus.classworlds.Launcher.launchEnhanced(Launcher.java:315)
	at org.codehaus.classworlds.Launcher.launch(Launcher.java:255)
	at org.codehaus.classworlds.Launcher.mainWithExitCode(Launcher.java:430)
	at org.codehaus.classworlds.Launcher.main(Launcher.java:375)
Caused by: org.apache.maven.plugin.CompilationFailureException: Compilation failure
	at org.apache.maven.plugin.AbstractCompilerMojo.execute(AbstractCompilerMojo.java:516)
	at org.apache.maven.plugin.CompilerMojo.execute(CompilerMojo.java:114)
	at org.apache.maven.plugin.DefaultPluginManager.executeMojo(DefaultPluginManager.java:451)
	at org.apache.maven.lifecycle.DefaultLifecycleExecutor.executeGoals(DefaultLifecycleExecutor.java:558)
	... 16 more
[INFO] ------------------------------------------------------------------------
[INFO] Total time: 17 minutes 2 seconds
[INFO] Finished at: Tue Aug 04 08:22:15 EDT 2009
[INFO] Final Memory: 239M/562M
[INFO] ------------------------------------------------------------------------

Mime
View raw message