geronimo-dev mailing list archives

Site index · List index
Message view « Date » · « Thread »
Top « Date » · « Thread »
From Shawn Jiang <genspr...@gmail.com>
Subject Re: [BUILD] branches/2.1: Failed for Revision: 796663
Date Thu, 23 Jul 2009 04:31:12 GMT
I got these failures locally.

On Wed, Jul 22, 2009 at 10:34 PM, Kevan Miller <kevan.miller@gmail.com>wrote:

> Are other people getting these failures? I don't see them on a local
> build...
>
> --kevan
>
> On Jul 22, 2009, at 9:02 AM, gawor@apache.org wrote:
>
>  Geronimo Revision: 796663 built with tests included
>>
>> See the full build-0800.log file at
>> http://people.apache.org/builds/geronimo/server/binaries/2.1/20090722/build-0800.log
>>
>> Download the binaries from
>> http://people.apache.org/builds/geronimo/server/binaries/2.1/20090722
>> [INFO] BUILD SUCCESSFUL
>> [INFO]
>> ------------------------------------------------------------------------
>> [INFO] Total time: 38 minutes 57 seconds
>> [INFO] Finished at: Wed Jul 22 08:46:43 EDT 2009
>> [INFO] Final Memory: 314M/946M
>> [INFO]
>> ------------------------------------------------------------------------
>>
>> TESTSUITE RESULTS (Failures only)
>> =================================
>>
>> Assembly: tomcat
>> =================================
>> See full test results and logs at
>> http://people.apache.org/builds/geronimo/server/binaries/2.1/20090722/logs-0800-tomcat/
>>
>> [INFO] Running corba-testsuite.corba-mytime
>> [INFO] Tests run: 1, Failures: 1, Errors: 0, Skipped: 0, Time elapsed:
>> 0.453 sec <<< FAILURE!
>> --
>> [INFO] Running sec-testsuite.security
>> [INFO] Tests run: 2, Failures: 1, Errors: 0, Skipped: 0, Time elapsed:
>> 0.695 sec <<< FAILURE!
>> [INFO] Running web-testsuite.jsps
>> [INFO] Tests run: 4, Failures: 4, Errors: 0, Skipped: 0, Time elapsed:
>> 1.199 sec <<< FAILURE!
>> --
>> [INFO] Running web-testsuite.myfaces
>> [INFO] Tests run: 1, Failures: 1, Errors: 0, Skipped: 0, Time elapsed:
>> 0.318 sec <<< FAILURE!
>> --
>> [INFO] Running org.apache.geronimo.testsuite.testset.JaxWSTest
>> [INFO] Tests run: 7, Failures: 1, Errors: 0, Skipped: 0, Time elapsed:
>> 2.035 sec <<< FAILURE!
>> --
>> [INFO] Running org.apache.geronimo.testsuite.testset.WebJAXRTest
>> [INFO] Tests run: 2, Failures: 1, Errors: 0, Skipped: 0, Time elapsed:
>> 0.183 sec <<< FAILURE!
>> --
>> [INFO] Running org.apache.geronimo.testsuite.testset.WebStaxTest
>> [INFO] Tests run: 2, Failures: 1, Errors: 0, Skipped: 0, Time elapsed:
>> 0.207 sec <<< FAILURE!
>> --
>> [INFO] Running org.apache.geronimo.testsuite.testset.WebJAXBTest
>> [INFO] Tests run: 2, Failures: 1, Errors: 0, Skipped: 0, Time elapsed:
>> 0.198 sec <<< FAILURE!
>> --
>> [INFO] Running org.apache.geronimo.testsuite.testset.WebSAAJTest
>> [INFO] Tests run: 2, Failures: 1, Errors: 0, Skipped: 0, Time elapsed:
>> 0.215 sec <<< FAILURE!
>>
>> Assembly: jetty
>> =================================
>> See full test results and logs at
>> http://people.apache.org/builds/geronimo/server/binaries/2.1/20090722/logs-0800-jetty/
>>
>> [INFO] Running corba-testsuite.corba-mytime
>> [INFO] Tests run: 1, Failures: 1, Errors: 0, Skipped: 0, Time elapsed:
>> 0.495 sec <<< FAILURE!
>> --
>> [INFO] Running sec-testsuite.security
>> [INFO] Tests run: 2, Failures: 1, Errors: 0, Skipped: 0, Time elapsed:
>> 0.74 sec <<< FAILURE!
>> [INFO] Running web-testsuite.jsps
>> [INFO] Tests run: 4, Failures: 4, Errors: 0, Skipped: 0, Time elapsed:
>> 1.24 sec <<< FAILURE!
>> --
>> [INFO] Running web-testsuite.myfaces
>> [INFO] Tests run: 1, Failures: 1, Errors: 0, Skipped: 0, Time elapsed:
>> 0.351 sec <<< FAILURE!
>> --
>> [INFO] Running org.apache.geronimo.testsuite.testset.JaxWSTest
>> [INFO] Tests run: 7, Failures: 1, Errors: 0, Skipped: 0, Time elapsed:
>> 1.679 sec <<< FAILURE!
>> --
>> [INFO] Running org.apache.geronimo.testsuite.testset.WebJAXRTest
>> [INFO] Tests run: 2, Failures: 1, Errors: 0, Skipped: 0, Time elapsed:
>> 0.19 sec <<< FAILURE!
>> --
>> [INFO] Running org.apache.geronimo.testsuite.testset.WebStaxTest
>> [INFO] Tests run: 2, Failures: 1, Errors: 0, Skipped: 0, Time elapsed:
>> 0.204 sec <<< FAILURE!
>> --
>> [INFO] Running org.apache.geronimo.testsuite.testset.WebJAXBTest
>> [INFO] Tests run: 2, Failures: 1, Errors: 0, Skipped: 0, Time elapsed:
>> 0.201 sec <<< FAILURE!
>> --
>> [INFO] Running org.apache.geronimo.testsuite.testset.WebSAAJTest
>> [INFO] Tests run: 2, Failures: 1, Errors: 0, Skipped: 0, Time elapsed:
>> 0.231 sec <<< FAILURE!
>>
>> Samples: branches/2.1
>> =================================
>> Log:
>> http://people.apache.org/builds/geronimo/server/binaries/2.1/20090722/samples-0800.log
>>
>> Build status: OK
>>
>>
>


-- 
Shawn

Mime
View raw message