geronimo-dev mailing list archives

Site index · List index
Message view « Date » · « Thread »
Top « Date » · « Thread »
From David Jencks <david_jen...@yahoo.com>
Subject Re: [BUILD] trunk: Failed for Revision: 795940
Date Mon, 20 Jul 2009 23:33:30 GMT
I looked at the tomcat security-testsuite/test-security failures and  
think the either test or the tomcat default servlet is wrong.

The test tries to access http://localhost:8080/demo/protect/hello.html
Its protected, so you get dispatched to the login form.  You can then  
login just fine.

However, firefox thinks the login form is the actual content so it  
keeps showing it to you.  If you press the refresh button, you get the  
expected content.

For some reason safari works more smoothly.

Anyone know how to prevent firefox from caching the login form?

thanks
david jencks
On Jul 20, 2009, at 1:43 PM, gawor@apache.org wrote:

> Geronimo Revision: 795940 built with tests included
>
> See the full build-1500.log file at http://people.apache.org/builds/geronimo/server/binaries/trunk/20090720/build-1500.log
>
> Download the binaries from http://people.apache.org/builds/geronimo/server/binaries/trunk/20090720
> [INFO] BUILD SUCCESSFUL
> [INFO]  
> ------------------------------------------------------------------------
> [INFO] Total time: 43 minutes 20 seconds
> [INFO] Finished at: Mon Jul 20 15:47:48 EDT 2009
> [INFO] Final Memory: 401M/1003M
> [INFO]  
> ------------------------------------------------------------------------
>
> TESTSUITE RESULTS (Failures only)
> =================================
>
> Assembly: tomcat
> =================================
> See full test results and logs at http://people.apache.org/builds/geronimo/server/binaries/trunk/20090720/logs-1500-tomcat/
>
>
> [INFO] Using geronimoHome: /home/geronimo/geronimo/trunk/testsuite/ 
> target/geronimo-tomcat6-javaee5-2.2-SNAPSHOT
> [INFO] Installing assembly...
> [INFO] Expanding: /home/geronimo/.m2/repository/org/apache/geronimo/ 
> assemblies/geronimo-tomcat6-javaee5/2.2-SNAPSHOT/geronimo-tomcat6- 
> javaee5-2.2-SNAPSHOT-bin.zip into /home/geronimo/geronimo/trunk/ 
> testsuite/target
> [INFO] Starting Geronimo server...
> [INFO] Selected option set: default
> [INFO] Redirecting output to: /home/geronimo/geronimo/trunk/ 
> testsuite/target/geronimo-logs/ 
> org.apache.geronimo.mavenplugins.geronimo.server.StartServerMojo.log
> [INFO] Waiting for Geronimo server...
> [INFO] Geronimo server started in 0:00:47.079
> [INFO] [shitty:install {execution: default}]
> [INFO] Installing /home/geronimo/geronimo/trunk/testsuite/pom.xml  
> to /home/geronimo/.m2/repository/org/apache/geronimo/testsuite/ 
> testsuite/testing/testsuite-testing.pom
> [INFO] [shitty:test {execution: default}]
> [INFO] Starting 36 test builds
> [INFO]
> [INFO]  
> -------------------------------------------------------------------------------
> [INFO]
> [INFO] commands-testsuite/deploy                  RUNNING
> [INFO] commands-testsuite/deploy                  SUCCESS  
> (0:01:18.934)
> [INFO] commands-testsuite/gshell                  RUNNING
> [INFO] commands-testsuite/gshell                  SUCCESS  
> (0:00:35.141)
> [INFO] commands-testsuite/jaxws                   RUNNING
> [INFO] commands-testsuite/jaxws                   SUCCESS  
> (0:00:41.560)
> [INFO] commands-testsuite/shutdown                RUNNING
> [INFO] commands-testsuite/shutdown                SUCCESS  
> (0:00:21.053)
> [INFO] concurrent-testsuite/concurrent-basic      RUNNING
> [INFO] concurrent-testsuite/concurrent-basic      SUCCESS  
> (0:06:32.226)
> [INFO] console-testsuite/advanced                 RUNNING
> [INFO] console-testsuite/advanced                 SUCCESS  
> (0:01:36.615)
> [INFO] console-testsuite/basic                    RUNNING
> [INFO] console-testsuite/basic                    SUCCESS  
> (0:02:03.304)
> [INFO] corba-testsuite/corba-helloworld           RUNNING
> [INFO] corba-testsuite/corba-helloworld           SUCCESS  
> (0:00:52.655)
> [INFO] corba-testsuite/corba-marshal              RUNNING
> [INFO] corba-testsuite/corba-marshal              SUCCESS  
> (0:01:05.044)
> [INFO] corba-testsuite/corba-mytime               RUNNING
> [INFO] corba-testsuite/corba-mytime               SUCCESS  
> (0:00:47.602)
> [INFO] deployment-testsuite/deployment-tests      RUNNING
> [INFO] deployment-testsuite/deployment-tests      SUCCESS  
> (0:00:33.435)
> [INFO] deployment-testsuite/jca-cms-tests         RUNNING
> [INFO] deployment-testsuite/jca-cms-tests         SUCCESS  
> (0:00:34.921)
> [INFO] deployment-testsuite/manifestcp-tests      RUNNING
> [INFO] deployment-testsuite/manifestcp-tests      SUCCESS  
> (0:00:36.717)
> [INFO] enterprise-testsuite/ejb-tests             RUNNING
> [INFO] enterprise-testsuite/ejb-tests             SUCCESS  
> (0:01:11.912)
> [INFO] enterprise-testsuite/jms-tests             RUNNING
> [INFO] enterprise-testsuite/jms-tests             SUCCESS  
> (0:01:00.206)
> [INFO] enterprise-testsuite/jpa-tests             RUNNING
> [INFO] enterprise-testsuite/jpa-tests             SUCCESS  
> (0:00:50.272)
> [INFO] enterprise-testsuite/sec-client            RUNNING
> [INFO] enterprise-testsuite/sec-client            SUCCESS  
> (0:00:31.209)
> [INFO] enterprise-testsuite/sec-tests             RUNNING
> [INFO] enterprise-testsuite/sec-tests             SUCCESS  
> (0:00:53.764)
> [INFO] security-testsuite/test-security           RUNNING
> [INFO] security-testsuite/test-security           FAILURE  
> (0:00:45.377) Java returned: 1
> [INFO] web-testsuite/test-2.1-jsps                RUNNING
> [INFO] web-testsuite/test-2.1-jsps                SUCCESS  
> (0:00:32.745)
> [INFO] web-testsuite/test-2.5-servlets            RUNNING
> [INFO] web-testsuite/test-2.5-servlets            SUCCESS  
> (0:00:31.136)
> [INFO] web-testsuite/test-myfaces                 RUNNING
> [INFO] web-testsuite/test-myfaces                 SUCCESS  
> (0:00:32.963)
> [INFO] web-testsuite/test-tomcat                  RUNNING
> [INFO] web-testsuite/test-tomcat                  FAILURE  
> (0:00:19.778) Java returned: 1
> [INFO] web-testsuite/test-web-forward             RUNNING
> [INFO] web-testsuite/test-web-forward             SUCCESS  
> (0:00:38.224)
> [INFO] web-testsuite/test-web-references          RUNNING
> [INFO] web-testsuite/test-web-references          SUCCESS  
> (0:00:44.936)
> [INFO] webservices-testsuite/jaxb-tests           RUNNING
> [INFO] webservices-testsuite/jaxb-tests           SUCCESS  
> (0:01:06.598)
> [INFO] webservices-testsuite/jaxr-tests           RUNNING
> [INFO] webservices-testsuite/jaxr-tests           SUCCESS  
> (0:00:59.896)
> [INFO] webservices-testsuite/jaxrpc-jaxws-tests   RUNNING
> [INFO] webservices-testsuite/jaxrpc-jaxws-tests   SUCCESS  
> (0:00:38.307)
> [INFO] webservices-testsuite/jaxrpc-tests         RUNNING
> [INFO] webservices-testsuite/jaxrpc-tests         SUCCESS  
> (0:00:47.863)
> [INFO] webservices-testsuite/jaxws-catalog-tests  RUNNING
> [INFO] webservices-testsuite/jaxws-catalog-tests  SUCCESS  
> (0:01:01.251)
> [INFO] webservices-testsuite/jaxws-mtom-tests     RUNNING
> [INFO] webservices-testsuite/jaxws-mtom-tests     SUCCESS  
> (0:00:59.038)
> [INFO] webservices-testsuite/jaxws-provider-tests RUNNING
> [INFO] webservices-testsuite/jaxws-provider-tests SUCCESS  
> (0:00:59.173)
> [INFO] webservices-testsuite/jaxws-tests          RUNNING
> [INFO] webservices-testsuite/jaxws-tests          FAILURE  
> (0:01:34.489) Java returned: 1
> [INFO] webservices-testsuite/jaxws-wsa-tests      RUNNING
> [INFO] webservices-testsuite/jaxws-wsa-tests      SUCCESS  
> (0:01:01.431)
> [INFO] webservices-testsuite/saaj-tests           RUNNING
> [INFO] webservices-testsuite/saaj-tests           SUCCESS  
> (0:00:40.567)
> [INFO] webservices-testsuite/stax-tests           RUNNING
> [INFO] webservices-testsuite/stax-tests           SUCCESS  
> (0:00:59.974)
> [INFO]
> [INFO]  
> -------------------------------------------------------------------------------
> [INFO] Test Summary (0:37:00.538)
> [INFO]     Passed: 33
> [INFO]     Failed: 3
> [INFO]  
> -------------------------------------------------------------------------------
> [INFO]
> [INFO] The following tests failed:
> [INFO]     * security-testsuite/test-security - /home/geronimo/ 
> geronimo/trunk/testsuite/security-testsuite/test-security/build.log
> [INFO]     * web-testsuite/test-tomcat - /home/geronimo/geronimo/ 
> trunk/testsuite/web-testsuite/test-tomcat/build.log
> [INFO]     * webservices-testsuite/jaxws-tests - /home/geronimo/ 
> geronimo/trunk/testsuite/webservices-testsuite/jaxws-tests/build.log
> [INFO]
> [INFO]  
> ------------------------------------------------------------------------
> [ERROR] BUILD ERROR
>
> Assembly: jetty
> =================================
> See full test results and logs at http://people.apache.org/builds/geronimo/server/binaries/trunk/20090720/logs-1500-jetty/
>
>
> [INFO] snapshot org.apache.geronimo.assemblies:geronimo-jetty7- 
> javaee5:2.2-SNAPSHOT: checking for updates from apache.snapshots
> [INFO] Using assembly artifact:  
> org.apache.geronimo.assemblies:geronimo-jetty7-javaee5:zip:bin:2.2- 
> SNAPSHOT:provided
> [INFO] Using geronimoHome: /home/geronimo/geronimo/trunk/testsuite/ 
> target/geronimo-jetty7-javaee5-2.2-SNAPSHOT
> [INFO] Installing assembly...
> [INFO] Expanding: /home/geronimo/.m2/repository/org/apache/geronimo/ 
> assemblies/geronimo-jetty7-javaee5/2.2-SNAPSHOT/geronimo-jetty7- 
> javaee5-2.2-SNAPSHOT-bin.zip into /home/geronimo/geronimo/trunk/ 
> testsuite/target
> [INFO] Starting Geronimo server...
> [INFO] Selected option set: default
> [INFO] Redirecting output to: /home/geronimo/geronimo/trunk/ 
> testsuite/target/geronimo-logs/ 
> org.apache.geronimo.mavenplugins.geronimo.server.StartServerMojo.log
> [INFO] Waiting for Geronimo server...
> [INFO] Geronimo server started in 0:00:48.897
> [INFO] [shitty:install {execution: default}]
> [INFO] Installing /home/geronimo/geronimo/trunk/testsuite/pom.xml  
> to /home/geronimo/.m2/repository/org/apache/geronimo/testsuite/ 
> testsuite/testing/testsuite-testing.pom
> [INFO] [shitty:test {execution: default}]
> [INFO] Starting 36 test builds
> [INFO]
> [INFO]  
> -------------------------------------------------------------------------------
> [INFO]
> [INFO] commands-testsuite/deploy                  RUNNING
> [INFO] commands-testsuite/deploy                  SUCCESS  
> (0:01:17.363)
> [INFO] commands-testsuite/gshell                  RUNNING
> [INFO] commands-testsuite/gshell                  SUCCESS  
> (0:00:36.304)
> [INFO] commands-testsuite/jaxws                   RUNNING
> [INFO] commands-testsuite/jaxws                   SUCCESS  
> (0:00:39.637)
> [INFO] commands-testsuite/shutdown                RUNNING
> [INFO] commands-testsuite/shutdown                SUCCESS  
> (0:00:21.781)
> [INFO] concurrent-testsuite/concurrent-basic      RUNNING
> [INFO] concurrent-testsuite/concurrent-basic      SUCCESS  
> (0:06:23.374)
> [INFO] console-testsuite/advanced                 RUNNING
> [INFO] console-testsuite/advanced                 SUCCESS  
> (0:01:35.644)
> [INFO] console-testsuite/basic                    RUNNING
> [INFO] console-testsuite/basic                    SUCCESS  
> (0:02:08.406)
> [INFO] corba-testsuite/corba-helloworld           RUNNING
> [INFO] corba-testsuite/corba-helloworld           SUCCESS  
> (0:00:55.286)
> [INFO] corba-testsuite/corba-marshal              RUNNING
> [INFO] corba-testsuite/corba-marshal              SUCCESS  
> (0:01:07.152)
> [INFO] corba-testsuite/corba-mytime               RUNNING
> [INFO] corba-testsuite/corba-mytime               SUCCESS  
> (0:00:47.238)
> [INFO] deployment-testsuite/deployment-tests      RUNNING
> [INFO] deployment-testsuite/deployment-tests      SUCCESS  
> (0:00:34.417)
> [INFO] deployment-testsuite/jca-cms-tests         RUNNING
> [INFO] deployment-testsuite/jca-cms-tests         SUCCESS  
> (0:00:33.996)
> [INFO] deployment-testsuite/manifestcp-tests      RUNNING
> [INFO] deployment-testsuite/manifestcp-tests      SUCCESS  
> (0:00:36.863)
> [INFO] enterprise-testsuite/ejb-tests             RUNNING
> [INFO] enterprise-testsuite/ejb-tests             SUCCESS  
> (0:00:46.699)
> [INFO] enterprise-testsuite/jms-tests             RUNNING
> [INFO] enterprise-testsuite/jms-tests             SUCCESS  
> (0:01:00.132)
> [INFO] enterprise-testsuite/jpa-tests             RUNNING
> [INFO] enterprise-testsuite/jpa-tests             SUCCESS  
> (0:00:46.232)
> [INFO] enterprise-testsuite/sec-client            RUNNING
> [INFO] enterprise-testsuite/sec-client            SUCCESS  
> (0:00:31.754)
> [INFO] enterprise-testsuite/sec-tests             RUNNING
> [INFO] enterprise-testsuite/sec-tests             SUCCESS  
> (0:00:53.001)
> [INFO] security-testsuite/test-security           RUNNING
> [INFO] security-testsuite/test-security           SUCCESS  
> (0:00:50.075)
> [INFO] web-testsuite/test-2.1-jsps                RUNNING
> [INFO] web-testsuite/test-2.1-jsps                SUCCESS  
> (0:00:34.159)
> [INFO] web-testsuite/test-2.5-servlets            RUNNING
> [INFO] web-testsuite/test-2.5-servlets            SUCCESS  
> (0:00:31.735)
> [INFO] web-testsuite/test-jetty                   RUNNING
> [INFO] web-testsuite/test-jetty                   SUCCESS  
> (0:00:24.488)
> [INFO] web-testsuite/test-myfaces                 RUNNING
> [INFO] web-testsuite/test-myfaces                 SUCCESS  
> (0:00:34.415)
> [INFO] web-testsuite/test-web-forward             RUNNING
> [INFO] web-testsuite/test-web-forward             SUCCESS  
> (0:00:40.049)
> [INFO] web-testsuite/test-web-references          RUNNING
> [INFO] web-testsuite/test-web-references          SUCCESS  
> (0:00:44.783)
> [INFO] webservices-testsuite/jaxb-tests           RUNNING
> [INFO] webservices-testsuite/jaxb-tests           SUCCESS  
> (0:01:08.507)
> [INFO] webservices-testsuite/jaxr-tests           RUNNING
> [INFO] webservices-testsuite/jaxr-tests           SUCCESS  
> (0:01:01.175)
> [INFO] webservices-testsuite/jaxrpc-jaxws-tests   RUNNING
> [INFO] webservices-testsuite/jaxrpc-jaxws-tests   SUCCESS  
> (0:00:34.343)
> [INFO] webservices-testsuite/jaxrpc-tests         RUNNING
> [INFO] webservices-testsuite/jaxrpc-tests         SUCCESS  
> (0:00:50.558)
> [INFO] webservices-testsuite/jaxws-catalog-tests  RUNNING
> [INFO] webservices-testsuite/jaxws-catalog-tests  SUCCESS  
> (0:00:54.988)
> [INFO] webservices-testsuite/jaxws-mtom-tests     RUNNING
> [INFO] webservices-testsuite/jaxws-mtom-tests     SUCCESS  
> (0:00:55.091)
> [INFO] webservices-testsuite/jaxws-provider-tests RUNNING
> [INFO] webservices-testsuite/jaxws-provider-tests SUCCESS  
> (0:01:05.790)
> [INFO] webservices-testsuite/jaxws-tests          RUNNING
> [INFO] webservices-testsuite/jaxws-tests          SUCCESS  
> (0:02:02.974)
> [INFO] webservices-testsuite/jaxws-wsa-tests      RUNNING
> [INFO] webservices-testsuite/jaxws-wsa-tests      FAILURE  
> (0:03:56.765) Java returned: 1
> [INFO] webservices-testsuite/saaj-tests           RUNNING
> [INFO] webservices-testsuite/saaj-tests           SUCCESS  
> (0:00:40.438)
> [INFO] webservices-testsuite/stax-tests           RUNNING
> [INFO] webservices-testsuite/stax-tests           SUCCESS  
> (0:01:00.987)
> [INFO]
> [INFO]  
> -------------------------------------------------------------------------------
> [INFO] Test Summary (0:40:06.805)
> [INFO]     Passed: 35
> [INFO]     Failed: 1
> [INFO]  
> -------------------------------------------------------------------------------
> [INFO]
> [INFO] The following tests failed:
> [INFO]     * webservices-testsuite/jaxws-wsa-tests - /home/geronimo/ 
> geronimo/trunk/testsuite/webservices-testsuite/jaxws-wsa-tests/ 
> build.log
> [INFO]
> [INFO]  
> ------------------------------------------------------------------------
> [ERROR] BUILD ERROR
>
> Samples: trunk
> =================================
> Log: http://people.apache.org/builds/geronimo/server/binaries/trunk/20090720/samples-1500.log
>
> Build status: OK
>

Mime
View raw message