geronimo-dev mailing list archives

Site index · List index
Message view « Date » · « Thread »
Top « Date » · « Thread »
From Ivan <xhh...@gmail.com>
Subject Re: [BUILD] trunk: Failed for Revision: 796268
Date Tue, 21 Jul 2009 14:52:58 GMT
Seems that those placeholders in the pom.xml are not replaced, like
${project.build.directory}/${artifactId}-${version}.ear.

2009/7/21 <gawor@apache.org>

> Geronimo Revision: 796268 built with tests included
>
> See the full build-0900.log file at
> http://people.apache.org/builds/geronimo/server/binaries/trunk/20090721/build-0900.log
>
> Download the binaries from
> http://people.apache.org/builds/geronimo/server/binaries/trunk/20090721
> [INFO] BUILD SUCCESSFUL
> [INFO]
> ------------------------------------------------------------------------
> [INFO] Total time: 43 minutes 6 seconds
> [INFO] Finished at: Tue Jul 21 09:47:56 EDT 2009
> [INFO] Final Memory: 400M/1014M
> [INFO]
> ------------------------------------------------------------------------
>
> TESTSUITE RESULTS (Failures only)
> =================================
>
> Assembly: tomcat
> =================================
> See full test results and logs at
> http://people.apache.org/builds/geronimo/server/binaries/trunk/20090721/logs-0900-tomcat/
>
>
> [INFO]
> -------------------------------------------------------------------------------
> [INFO]
> [INFO] commands-testsuite/deploy                  RUNNING
> [INFO] commands-testsuite/deploy                  SUCCESS (0:01:18.110)
> [INFO] commands-testsuite/gshell                  RUNNING
> [INFO] commands-testsuite/gshell                  SUCCESS (0:00:35.438)
> [INFO] commands-testsuite/jaxws                   RUNNING
> [INFO] commands-testsuite/jaxws                   SUCCESS (0:00:40.040)
> [INFO] commands-testsuite/shutdown                RUNNING
> [INFO] commands-testsuite/shutdown                SUCCESS (0:00:21.145)
> [INFO] concurrent-testsuite/concurrent-basic      RUNNING
> [INFO] concurrent-testsuite/concurrent-basic      FAILURE (0:01:02.257)
> Java returned: 1
> [INFO] console-testsuite/advanced                 RUNNING
> [INFO] console-testsuite/advanced                 SUCCESS (0:01:34.237)
> [INFO] console-testsuite/basic                    RUNNING
> [INFO] console-testsuite/basic                    SUCCESS (0:02:03.987)
> [INFO] corba-testsuite/corba-helloworld           RUNNING
> [INFO] corba-testsuite/corba-helloworld           FAILURE (0:00:37.538)
> Java returned: 1
> [INFO] corba-testsuite/corba-marshal              RUNNING
> [INFO] corba-testsuite/corba-marshal              FAILURE (0:00:31.478)
> Java returned: 1
> [INFO] corba-testsuite/corba-mytime               RUNNING
> [INFO] corba-testsuite/corba-mytime               FAILURE (0:00:38.511)
> Java returned: 1
> [INFO] deployment-testsuite/deployment-tests      RUNNING
> [INFO] deployment-testsuite/deployment-tests      SUCCESS (0:00:35.017)
> [INFO] deployment-testsuite/jca-cms-tests         RUNNING
> [INFO] deployment-testsuite/jca-cms-tests         SUCCESS (0:00:31.879)
> [INFO] deployment-testsuite/manifestcp-tests      RUNNING
> [INFO] deployment-testsuite/manifestcp-tests      SUCCESS (0:00:36.766)
> [INFO] enterprise-testsuite/ejb-tests             RUNNING
> [INFO] enterprise-testsuite/ejb-tests             FAILURE (0:01:06.704)
> Java returned: 1
> [INFO] enterprise-testsuite/jms-tests             RUNNING
> [INFO] enterprise-testsuite/jms-tests             FAILURE (0:00:45.748)
> Java returned: 1
> [INFO] enterprise-testsuite/jpa-tests             RUNNING
> [INFO] enterprise-testsuite/jpa-tests             FAILURE (0:00:44.101)
> Java returned: 1
> [INFO] enterprise-testsuite/sec-client            RUNNING
> [INFO] enterprise-testsuite/sec-client            SUCCESS (0:00:30.810)
> [INFO] enterprise-testsuite/sec-tests             RUNNING
> [INFO] enterprise-testsuite/sec-tests             FAILURE (0:00:35.854)
> Java returned: 1
> [INFO] security-testsuite/test-security           RUNNING
> [INFO] security-testsuite/test-security           FAILURE (0:00:46.252)
> Java returned: 1
> [INFO] web-testsuite/test-2.1-jsps                RUNNING
> [INFO] web-testsuite/test-2.1-jsps                SUCCESS (0:00:35.117)
> [INFO] web-testsuite/test-2.5-servlets            RUNNING
> [INFO] web-testsuite/test-2.5-servlets            SUCCESS (0:00:30.992)
> [INFO] web-testsuite/test-myfaces                 RUNNING
> [INFO] web-testsuite/test-myfaces                 SUCCESS (0:00:32.811)
> [INFO] web-testsuite/test-tomcat                  RUNNING
> [INFO] web-testsuite/test-tomcat                  SUCCESS (0:00:24.121)
> [INFO] web-testsuite/test-web-forward             RUNNING
> [INFO] web-testsuite/test-web-forward             FAILURE (0:00:33.124)
> Java returned: 1
> [INFO] web-testsuite/test-web-references          RUNNING
> [INFO] web-testsuite/test-web-references          FAILURE (0:00:37.549)
> Java returned: 1
> [INFO] webservices-testsuite/jaxb-tests           RUNNING
> [INFO] webservices-testsuite/jaxb-tests           SUCCESS (0:01:07.333)
> [INFO] webservices-testsuite/jaxr-tests           RUNNING
> [INFO] webservices-testsuite/jaxr-tests           SUCCESS (0:00:57.782)
> [INFO] webservices-testsuite/jaxrpc-jaxws-tests   RUNNING
> [INFO] webservices-testsuite/jaxrpc-jaxws-tests   SUCCESS (0:00:39.106)
> [INFO] webservices-testsuite/jaxrpc-tests         RUNNING
> [INFO] webservices-testsuite/jaxrpc-tests         SUCCESS (0:00:50.092)
> [INFO] webservices-testsuite/jaxws-catalog-tests  RUNNING
> [INFO] webservices-testsuite/jaxws-catalog-tests  FAILURE (0:00:50.927)
> Java returned: 1
> [INFO] webservices-testsuite/jaxws-mtom-tests     RUNNING
> [INFO] webservices-testsuite/jaxws-mtom-tests     FAILURE (0:00:44.501)
> Java returned: 1
> [INFO] webservices-testsuite/jaxws-provider-tests RUNNING
> [INFO] webservices-testsuite/jaxws-provider-tests FAILURE (0:00:49.174)
> Java returned: 1
> [INFO] webservices-testsuite/jaxws-tests          RUNNING
> [INFO] webservices-testsuite/jaxws-tests          FAILURE (0:01:21.935)
> Java returned: 1
> [INFO] webservices-testsuite/jaxws-wsa-tests      RUNNING
> [INFO] webservices-testsuite/jaxws-wsa-tests      FAILURE (0:00:47.836)
> Java returned: 1
> [INFO] webservices-testsuite/saaj-tests           RUNNING
> [INFO] webservices-testsuite/saaj-tests           SUCCESS (0:00:40.338)
> [INFO] webservices-testsuite/stax-tests           RUNNING
> [INFO] webservices-testsuite/stax-tests           SUCCESS (0:00:59.831)
> [INFO]
> [INFO]
> -------------------------------------------------------------------------------
> [INFO] Test Summary (0:28:38.669)
> [INFO]     Passed: 20
> [INFO]     Failed: 16
> [INFO]
> -------------------------------------------------------------------------------
> [INFO]
> [INFO] The following tests failed:
> [INFO]     * concurrent-testsuite/concurrent-basic -
> /home/geronimo/geronimo/trunk/testsuite/concurrent-testsuite/concurrent-basic/build.log
> [INFO]     * corba-testsuite/corba-helloworld -
> /home/geronimo/geronimo/trunk/testsuite/corba-testsuite/corba-helloworld/build.log
> [INFO]     * corba-testsuite/corba-marshal -
> /home/geronimo/geronimo/trunk/testsuite/corba-testsuite/corba-marshal/build.log
> [INFO]     * corba-testsuite/corba-mytime -
> /home/geronimo/geronimo/trunk/testsuite/corba-testsuite/corba-mytime/build.log
> [INFO]     * enterprise-testsuite/ejb-tests -
> /home/geronimo/geronimo/trunk/testsuite/enterprise-testsuite/ejb-tests/build.log
> [INFO]     * enterprise-testsuite/jms-tests -
> /home/geronimo/geronimo/trunk/testsuite/enterprise-testsuite/jms-tests/build.log
> [INFO]     * enterprise-testsuite/jpa-tests -
> /home/geronimo/geronimo/trunk/testsuite/enterprise-testsuite/jpa-tests/build.log
> [INFO]     * enterprise-testsuite/sec-tests -
> /home/geronimo/geronimo/trunk/testsuite/enterprise-testsuite/sec-tests/build.log
> [INFO]     * security-testsuite/test-security -
> /home/geronimo/geronimo/trunk/testsuite/security-testsuite/test-security/build.log
> [INFO]     * web-testsuite/test-web-forward -
> /home/geronimo/geronimo/trunk/testsuite/web-testsuite/test-web-forward/build.log
> [INFO]     * web-testsuite/test-web-references -
> /home/geronimo/geronimo/trunk/testsuite/web-testsuite/test-web-references/build.log
> [INFO]     * webservices-testsuite/jaxws-catalog-tests -
> /home/geronimo/geronimo/trunk/testsuite/webservices-testsuite/jaxws-catalog-tests/build.log
> [INFO]     * webservices-testsuite/jaxws-mtom-tests -
> /home/geronimo/geronimo/trunk/testsuite/webservices-testsuite/jaxws-mtom-tests/build.log
> [INFO]     * webservices-testsuite/jaxws-provider-tests -
> /home/geronimo/geronimo/trunk/testsuite/webservices-testsuite/jaxws-provider-tests/build.log
> [INFO]     * webservices-testsuite/jaxws-tests -
> /home/geronimo/geronimo/trunk/testsuite/webservices-testsuite/jaxws-tests/build.log
> [INFO]     * webservices-testsuite/jaxws-wsa-tests -
> /home/geronimo/geronimo/trunk/testsuite/webservices-testsuite/jaxws-wsa-tests/build.log
> [INFO]
> [INFO]
> ------------------------------------------------------------------------
> [ERROR] BUILD ERROR
>
> Assembly: jetty
> =================================
> See full test results and logs at
> http://people.apache.org/builds/geronimo/server/binaries/trunk/20090721/logs-0900-jetty/
>
>
> [INFO]
> -------------------------------------------------------------------------------
> [INFO]
> [INFO] commands-testsuite/deploy                  RUNNING
> [INFO] commands-testsuite/deploy                  SUCCESS (0:01:15.963)
> [INFO] commands-testsuite/gshell                  RUNNING
> [INFO] commands-testsuite/gshell                  SUCCESS (0:00:35.987)
> [INFO] commands-testsuite/jaxws                   RUNNING
> [INFO] commands-testsuite/jaxws                   SUCCESS (0:00:39.540)
> [INFO] commands-testsuite/shutdown                RUNNING
> [INFO] commands-testsuite/shutdown                SUCCESS (0:00:21.134)
> [INFO] concurrent-testsuite/concurrent-basic      RUNNING
> [INFO] concurrent-testsuite/concurrent-basic      FAILURE (0:00:43.628)
> Java returned: 1
> [INFO] console-testsuite/advanced                 RUNNING
> [INFO] console-testsuite/advanced                 FAILURE (0:00:21.599)
> Java returned: 1
> [INFO] console-testsuite/basic                    RUNNING
> [INFO] console-testsuite/basic                    SUCCESS (0:02:12.427)
> [INFO] corba-testsuite/corba-helloworld           RUNNING
> [INFO] corba-testsuite/corba-helloworld           FAILURE (0:00:35.108)
> Java returned: 1
> [INFO] corba-testsuite/corba-marshal              RUNNING
> [INFO] corba-testsuite/corba-marshal              FAILURE (0:00:30.946)
> Java returned: 1
> [INFO] corba-testsuite/corba-mytime               RUNNING
> [INFO] corba-testsuite/corba-mytime               FAILURE (0:00:36.917)
> Java returned: 1
> [INFO] deployment-testsuite/deployment-tests      RUNNING
> [INFO] deployment-testsuite/deployment-tests      SUCCESS (0:00:36.644)
> [INFO] deployment-testsuite/jca-cms-tests         RUNNING
> [INFO] deployment-testsuite/jca-cms-tests         SUCCESS (0:00:29.445)
> [INFO] deployment-testsuite/manifestcp-tests      RUNNING
> [INFO] deployment-testsuite/manifestcp-tests      SUCCESS (0:00:35.467)
> [INFO] enterprise-testsuite/ejb-tests             RUNNING
> [INFO] enterprise-testsuite/ejb-tests             FAILURE (0:00:40.779)
> Java returned: 1
> [INFO] enterprise-testsuite/jms-tests             RUNNING
> [INFO] enterprise-testsuite/jms-tests             FAILURE (0:00:45.112)
> Java returned: 1
> [INFO] enterprise-testsuite/jpa-tests             RUNNING
> [INFO] enterprise-testsuite/jpa-tests             FAILURE (0:00:39.588)
> Java returned: 1
> [INFO] enterprise-testsuite/sec-client            RUNNING
> [INFO] enterprise-testsuite/sec-client            SUCCESS (0:00:32.064)
> [INFO] enterprise-testsuite/sec-tests             RUNNING
> [INFO] enterprise-testsuite/sec-tests             FAILURE (0:00:34.745)
> Java returned: 1
> [INFO] security-testsuite/test-security           RUNNING
> [INFO] security-testsuite/test-security           SUCCESS (0:00:50.536)
> [INFO] web-testsuite/test-2.1-jsps                RUNNING
> [INFO] web-testsuite/test-2.1-jsps                SUCCESS (0:00:36.459)
> [INFO] web-testsuite/test-2.5-servlets            RUNNING
> [INFO] web-testsuite/test-2.5-servlets            SUCCESS (0:00:31.624)
> [INFO] web-testsuite/test-jetty                   RUNNING
> [INFO] web-testsuite/test-jetty                   SUCCESS (0:00:25.658)
> [INFO] web-testsuite/test-myfaces                 RUNNING
> [INFO] web-testsuite/test-myfaces                 SUCCESS (0:00:34.646)
> [INFO] web-testsuite/test-web-forward             RUNNING
> [INFO] web-testsuite/test-web-forward             FAILURE (0:00:34.280)
> Java returned: 1
> [INFO] web-testsuite/test-web-references          RUNNING
> [INFO] web-testsuite/test-web-references          FAILURE (0:00:38.191)
> Java returned: 1
> [INFO] webservices-testsuite/jaxb-tests           RUNNING
> [INFO] webservices-testsuite/jaxb-tests           SUCCESS (0:01:07.626)
> [INFO] webservices-testsuite/jaxr-tests           RUNNING
> [INFO] webservices-testsuite/jaxr-tests           SUCCESS (0:01:00.240)
> [INFO] webservices-testsuite/jaxrpc-jaxws-tests   RUNNING
> [INFO] webservices-testsuite/jaxrpc-jaxws-tests   SUCCESS (0:00:34.586)
> [INFO] webservices-testsuite/jaxrpc-tests         RUNNING
> [INFO] webservices-testsuite/jaxrpc-tests         SUCCESS (0:00:49.382)
> [INFO] webservices-testsuite/jaxws-catalog-tests  RUNNING
> [INFO] webservices-testsuite/jaxws-catalog-tests  FAILURE (0:00:47.098)
> Java returned: 1
> [INFO] webservices-testsuite/jaxws-mtom-tests     RUNNING
> [INFO] webservices-testsuite/jaxws-mtom-tests     FAILURE (0:00:40.721)
> Java returned: 1
> [INFO] webservices-testsuite/jaxws-provider-tests RUNNING
> [INFO] webservices-testsuite/jaxws-provider-tests FAILURE (0:00:46.894)
> Java returned: 1
> [INFO] webservices-testsuite/jaxws-tests          RUNNING
> [INFO] webservices-testsuite/jaxws-tests          FAILURE (0:01:17.634)
> Java returned: 1
> [INFO] webservices-testsuite/jaxws-wsa-tests      RUNNING
> [INFO] webservices-testsuite/jaxws-wsa-tests      FAILURE (0:00:43.590)
> Java returned: 1
> [INFO] webservices-testsuite/saaj-tests           RUNNING
> [INFO] webservices-testsuite/saaj-tests           SUCCESS (0:00:40.969)
> [INFO] webservices-testsuite/stax-tests           RUNNING
> [INFO] webservices-testsuite/stax-tests           SUCCESS (0:01:00.155)
> [INFO]
> [INFO]
> -------------------------------------------------------------------------------
> [INFO] Test Summary (0:26:27.637)
> [INFO]     Passed: 20
> [INFO]     Failed: 16
> [INFO]
> -------------------------------------------------------------------------------
> [INFO]
> [INFO] The following tests failed:
> [INFO]     * concurrent-testsuite/concurrent-basic -
> /home/geronimo/geronimo/trunk/testsuite/concurrent-testsuite/concurrent-basic/build.log
> [INFO]     * console-testsuite/advanced -
> /home/geronimo/geronimo/trunk/testsuite/console-testsuite/advanced/build.log
> [INFO]     * corba-testsuite/corba-helloworld -
> /home/geronimo/geronimo/trunk/testsuite/corba-testsuite/corba-helloworld/build.log
> [INFO]     * corba-testsuite/corba-marshal -
> /home/geronimo/geronimo/trunk/testsuite/corba-testsuite/corba-marshal/build.log
> [INFO]     * corba-testsuite/corba-mytime -
> /home/geronimo/geronimo/trunk/testsuite/corba-testsuite/corba-mytime/build.log
> [INFO]     * enterprise-testsuite/ejb-tests -
> /home/geronimo/geronimo/trunk/testsuite/enterprise-testsuite/ejb-tests/build.log
> [INFO]     * enterprise-testsuite/jms-tests -
> /home/geronimo/geronimo/trunk/testsuite/enterprise-testsuite/jms-tests/build.log
> [INFO]     * enterprise-testsuite/jpa-tests -
> /home/geronimo/geronimo/trunk/testsuite/enterprise-testsuite/jpa-tests/build.log
> [INFO]     * enterprise-testsuite/sec-tests -
> /home/geronimo/geronimo/trunk/testsuite/enterprise-testsuite/sec-tests/build.log
> [INFO]     * web-testsuite/test-web-forward -
> /home/geronimo/geronimo/trunk/testsuite/web-testsuite/test-web-forward/build.log
> [INFO]     * web-testsuite/test-web-references -
> /home/geronimo/geronimo/trunk/testsuite/web-testsuite/test-web-references/build.log
> [INFO]     * webservices-testsuite/jaxws-catalog-tests -
> /home/geronimo/geronimo/trunk/testsuite/webservices-testsuite/jaxws-catalog-tests/build.log
> [INFO]     * webservices-testsuite/jaxws-mtom-tests -
> /home/geronimo/geronimo/trunk/testsuite/webservices-testsuite/jaxws-mtom-tests/build.log
> [INFO]     * webservices-testsuite/jaxws-provider-tests -
> /home/geronimo/geronimo/trunk/testsuite/webservices-testsuite/jaxws-provider-tests/build.log
> [INFO]     * webservices-testsuite/jaxws-tests -
> /home/geronimo/geronimo/trunk/testsuite/webservices-testsuite/jaxws-tests/build.log
> [INFO]     * webservices-testsuite/jaxws-wsa-tests -
> /home/geronimo/geronimo/trunk/testsuite/webservices-testsuite/jaxws-wsa-tests/build.log
> [INFO]
> [INFO]
> ------------------------------------------------------------------------
> [ERROR] BUILD ERROR
>
> Samples: trunk
> =================================
> Log:
> http://people.apache.org/builds/geronimo/server/binaries/trunk/20090721/samples-0900.log
>
> Build status: OK
>
>


-- 
Ivan

Mime
View raw message