geronimo-dev mailing list archives

Site index · List index
Message view « Date » · « Thread »
Top « Date » · « Thread »
From ga...@apache.org
Subject [BUILD] branches/2.1: Failed for Revision: 797142
Date Thu, 23 Jul 2009 19:00:52 GMT
Geronimo Revision: 797142 built with tests included
 
See the full build-1400.log file at http://people.apache.org/builds/geronimo/server/binaries/2.1/20090723/build-1400.log
 
Download the binaries from http://people.apache.org/builds/geronimo/server/binaries/2.1/20090723
[INFO] BUILD SUCCESSFUL
[INFO] ------------------------------------------------------------------------
[INFO] Total time: 38 minutes 27 seconds
[INFO] Finished at: Thu Jul 23 14:44:29 EDT 2009
[INFO] Final Memory: 315M/929M
[INFO] ------------------------------------------------------------------------
 
TESTSUITE RESULTS (Failures only)
=================================
 
Assembly: tomcat
=================================
See full test results and logs at http://people.apache.org/builds/geronimo/server/binaries/2.1/20090723/logs-1400-tomcat/
 
[INFO] Running corba-testsuite.corba-mytime
[INFO] Tests run: 1, Failures: 1, Errors: 0, Skipped: 0, Time elapsed: 0.443 sec <<<
FAILURE!
--
[INFO] Running sec-testsuite.security
[INFO] Tests run: 2, Failures: 1, Errors: 0, Skipped: 0, Time elapsed: 0.724 sec <<<
FAILURE!
[INFO] Running web-testsuite.jsps
[INFO] Tests run: 4, Failures: 4, Errors: 0, Skipped: 0, Time elapsed: 1.152 sec <<<
FAILURE!
--
[INFO] Running web-testsuite.myfaces
[INFO] Tests run: 1, Failures: 1, Errors: 0, Skipped: 0, Time elapsed: 0.306 sec <<<
FAILURE!
--
[INFO] Running org.apache.geronimo.testsuite.testset.JaxWSTest
[INFO] Tests run: 7, Failures: 1, Errors: 0, Skipped: 0, Time elapsed: 2.413 sec <<<
FAILURE!
--
[INFO] Running org.apache.geronimo.testsuite.testset.WebJAXRTest
[INFO] Tests run: 2, Failures: 1, Errors: 0, Skipped: 0, Time elapsed: 0.186 sec <<<
FAILURE!
--
[INFO] Running org.apache.geronimo.testsuite.testset.WebStaxTest
[INFO] Tests run: 2, Failures: 1, Errors: 0, Skipped: 0, Time elapsed: 0.21 sec <<<
FAILURE!
--
[INFO] Running org.apache.geronimo.testsuite.testset.WebJAXBTest
[INFO] Tests run: 2, Failures: 1, Errors: 0, Skipped: 0, Time elapsed: 0.198 sec <<<
FAILURE!
--
[INFO] Running org.apache.geronimo.testsuite.testset.WebSAAJTest
[INFO] Tests run: 2, Failures: 1, Errors: 0, Skipped: 0, Time elapsed: 0.214 sec <<<
FAILURE!
 
Assembly: jetty
=================================
See full test results and logs at http://people.apache.org/builds/geronimo/server/binaries/2.1/20090723/logs-1400-jetty/
 
[INFO] Running corba-testsuite.corba-mytime
[INFO] Tests run: 1, Failures: 1, Errors: 0, Skipped: 0, Time elapsed: 0.505 sec <<<
FAILURE!
--
[INFO] Running sec-testsuite.security
[INFO] Tests run: 2, Failures: 1, Errors: 0, Skipped: 0, Time elapsed: 0.726 sec <<<
FAILURE!
[INFO] Running web-testsuite.jsps
[INFO] Tests run: 4, Failures: 4, Errors: 0, Skipped: 0, Time elapsed: 1.241 sec <<<
FAILURE!
--
[INFO] Running web-testsuite.myfaces
[INFO] Tests run: 1, Failures: 1, Errors: 0, Skipped: 0, Time elapsed: 0.377 sec <<<
FAILURE!
--
[INFO] Running org.apache.geronimo.testsuite.testset.JaxWSTest
[INFO] Tests run: 7, Failures: 1, Errors: 0, Skipped: 0, Time elapsed: 1.615 sec <<<
FAILURE!
--
[INFO] Running org.apache.geronimo.testsuite.testset.WebJAXRTest
[INFO] Tests run: 2, Failures: 1, Errors: 0, Skipped: 0, Time elapsed: 0.192 sec <<<
FAILURE!
--
[INFO] Running org.apache.geronimo.testsuite.testset.WebStaxTest
[INFO] Tests run: 2, Failures: 1, Errors: 0, Skipped: 0, Time elapsed: 0.208 sec <<<
FAILURE!
--
[INFO] Running org.apache.geronimo.testsuite.testset.WebJAXBTest
[INFO] Tests run: 2, Failures: 1, Errors: 0, Skipped: 0, Time elapsed: 0.2 sec <<<
FAILURE!
--
[INFO] Running org.apache.geronimo.testsuite.testset.WebSAAJTest
[INFO] Tests run: 2, Failures: 1, Errors: 0, Skipped: 0, Time elapsed: 0.236 sec <<<
FAILURE!
 
Samples: branches/2.1
=================================
Log: http://people.apache.org/builds/geronimo/server/binaries/2.1/20090723/samples-1400.log
 
Build status: OK
 

Mime
View raw message