geronimo-dev mailing list archives

Site index · List index
Message view « Date » · « Thread »
Top « Date » · « Thread »
From Jarek Gawor <jga...@gmail.com>
Subject Re: [BUILD] trunk: Failed for Revision: 786797
Date Mon, 22 Jun 2009 14:37:26 GMT
You should be able to open the ResultsSummary.html page, however, it
is not properly updated for trunk and I meant to remove this link.

Jarek

On Sat, Jun 20, 2009 at 10:51 AM, Ivan<xhhsld@gmail.com> wrote:
>
> Hi,
>     I found the detailed results link
> "http://people.apache.org/builds/geronimo/server/testsuite/ResultsSummary.html"
> could not be opened.
>     Not sure where those extra configurations are needed. Could anyone help
> to figure it out ?
>    Thanks !
> Ivan
>
> 2009/6/20 <gawor@apache.org>
>>
>> Geronimo Revision: 786797 built with tests included
>>
>> See the full build-0900.log file at
>> http://people.apache.org/builds/geronimo/server/binaries/trunk/20090620/build-0900.log
>>
>> Download the binaries from
>> http://people.apache.org/builds/geronimo/server/binaries/trunk/20090620
>> [INFO] BUILD SUCCESSFUL
>> [INFO]
>> ------------------------------------------------------------------------
>> [INFO] Total time: 39 minutes 52 seconds
>> [INFO] Finished at: Sat Jun 20 09:44:12 EDT 2009
>> [INFO] Final Memory: 404M/1015M
>> [INFO]
>> ------------------------------------------------------------------------
>>
>> TESTSUITE RESULTS (Failures only)
>> =================================
>> See detailed results at
>> http://people.apache.org/builds/geronimo/server/testsuite/ResultsSummary.html
>>
>> Assembly: tomcat
>> =================================
>> See the full test.log file at
>> http://people.apache.org/builds/geronimo/server/binaries/trunk/20090620/logs-0900-tomcat/test.log
>>
>>
>> [INFO] Expanding:
>> /home/geronimo/.m2/repository/org/apache/geronimo/assemblies/geronimo-tomcat6-javaee5/2.2-SNAPSHOT/geronimo-tomcat6-javaee5-2.2-SNAPSHOT-bin.zip
>> into /home/geronimo/geronimo/trunk/testsuite/target
>> [INFO] Starting Geronimo server...
>> [INFO] Selected option set: default
>> [INFO] Redirecting output to:
>> /home/geronimo/geronimo/trunk/testsuite/target/geronimo-logs/org.apache.geronimo.mavenplugins.geronimo.server.StartServerMojo.log
>> [INFO] Waiting for Geronimo server...
>> [INFO] Geronimo server started in 0:00:43.969
>> [INFO] [shitty:install {execution: default}]
>> [INFO] Installing /home/geronimo/geronimo/trunk/testsuite/pom.xml to
>> /home/geronimo/.m2/repository/org/apache/geronimo/testsuite/testsuite/testing/testsuite-testing.pom
>> [INFO] [shitty:test {execution: default}]
>> [INFO] Starting 36 test builds
>> [INFO]
>> [INFO]
>> -------------------------------------------------------------------------------
>> [INFO]
>> [INFO] commands-testsuite/deploy                  RUNNING
>> [INFO] commands-testsuite/deploy                  SUCCESS (0:01:15.516)
>> [INFO] commands-testsuite/gshell                  RUNNING
>> [INFO] commands-testsuite/gshell                  SUCCESS (0:00:34.390)
>> [INFO] commands-testsuite/jaxws                   RUNNING
>> [INFO] commands-testsuite/jaxws                   SUCCESS (0:00:39.892)
>> [INFO] commands-testsuite/shutdown                RUNNING
>> [INFO] commands-testsuite/shutdown                SUCCESS (0:00:21.337)
>> [INFO] concurrent-testsuite/concurrent-basic      RUNNING
>> [INFO] concurrent-testsuite/concurrent-basic      SUCCESS (0:06:19.577)
>> [INFO] console-testsuite/advanced                 RUNNING
>> [INFO] console-testsuite/advanced                 FAILURE (0:01:25.131)
>> Java returned: 1
>> [INFO] console-testsuite/basic                    RUNNING
>> [INFO] console-testsuite/basic                    SUCCESS (0:02:00.296)
>> [INFO] corba-testsuite/corba-helloworld           RUNNING
>> [INFO] corba-testsuite/corba-helloworld           SUCCESS (0:00:52.730)
>> [INFO] corba-testsuite/corba-marshal              RUNNING
>> [INFO] corba-testsuite/corba-marshal              SUCCESS (0:01:28.953)
>> [INFO] corba-testsuite/corba-mytime               RUNNING
>> [INFO] corba-testsuite/corba-mytime               SUCCESS (0:00:47.251)
>> [INFO] deployment-testsuite/deployment-tests      RUNNING
>> [INFO] deployment-testsuite/deployment-tests      SUCCESS (0:00:33.767)
>> [INFO] deployment-testsuite/jca-cms-tests         RUNNING
>> [INFO] deployment-testsuite/jca-cms-tests         SUCCESS (0:00:34.566)
>> [INFO] deployment-testsuite/manifestcp-tests      RUNNING
>> [INFO] deployment-testsuite/manifestcp-tests      SUCCESS (0:00:37.434)
>> [INFO] enterprise-testsuite/ejb-tests             RUNNING
>> [INFO] enterprise-testsuite/ejb-tests             SUCCESS (0:01:00.574)
>> [INFO] enterprise-testsuite/jms-tests             RUNNING
>> [INFO] enterprise-testsuite/jms-tests             SUCCESS (0:01:02.013)
>> [INFO] enterprise-testsuite/jpa-tests             RUNNING
>> [INFO] enterprise-testsuite/jpa-tests             SUCCESS (0:00:51.883)
>> [INFO] enterprise-testsuite/sec-client            RUNNING
>> [INFO] enterprise-testsuite/sec-client            FAILURE (0:00:26.953)
>> Java returned: 1
>> [INFO] enterprise-testsuite/sec-tests             RUNNING
>> [INFO] enterprise-testsuite/sec-tests             FAILURE (0:00:38.135)
>> Java returned: 1
>> [INFO] security-testsuite/test-security           RUNNING
>> [INFO] security-testsuite/test-security           SUCCESS (0:00:49.572)
>> [INFO] web-testsuite/test-2.1-jsps                RUNNING
>> [INFO] web-testsuite/test-2.1-jsps                SUCCESS (0:00:32.727)
>> [INFO] web-testsuite/test-2.5-servlets            RUNNING
>> [INFO] web-testsuite/test-2.5-servlets            SUCCESS (0:00:31.729)
>> [INFO] web-testsuite/test-myfaces                 RUNNING
>> [INFO] web-testsuite/test-myfaces                 SUCCESS (0:00:33.525)
>> [INFO] web-testsuite/test-tomcat                  RUNNING
>> [INFO] web-testsuite/test-tomcat                  FAILURE (0:00:20.187)
>> Java returned: 1
>> [INFO] web-testsuite/test-web-forward             RUNNING
>> [INFO] web-testsuite/test-web-forward             SUCCESS (0:00:37.743)
>> [INFO] web-testsuite/test-web-references          RUNNING
>> [INFO] web-testsuite/test-web-references          SUCCESS (0:00:43.944)
>> [INFO] webservices-testsuite/jaxb-tests           RUNNING
>> [INFO] webservices-testsuite/jaxb-tests           SUCCESS (0:01:07.810)
>> [INFO] webservices-testsuite/jaxr-tests           RUNNING
>> [INFO] webservices-testsuite/jaxr-tests           SUCCESS (0:00:59.655)
>> [INFO] webservices-testsuite/jaxrpc-jaxws-tests   RUNNING
>> [INFO] webservices-testsuite/jaxrpc-jaxws-tests   SUCCESS (0:00:39.862)
>> [INFO] webservices-testsuite/jaxrpc-tests         RUNNING
>> [INFO] webservices-testsuite/jaxrpc-tests         SUCCESS (0:00:50.282)
>> [INFO] webservices-testsuite/jaxws-catalog-tests  RUNNING
>> [INFO] webservices-testsuite/jaxws-catalog-tests  SUCCESS (0:00:56.726)
>> [INFO] webservices-testsuite/jaxws-mtom-tests     RUNNING
>> [INFO] webservices-testsuite/jaxws-mtom-tests     SUCCESS (0:01:00.323)
>> [INFO] webservices-testsuite/jaxws-provider-tests RUNNING
>> [INFO] webservices-testsuite/jaxws-provider-tests SUCCESS (0:01:05.094)
>> [INFO] webservices-testsuite/jaxws-tests          RUNNING
>> [INFO] webservices-testsuite/jaxws-tests          FAILURE (0:01:43.376)
>> Java returned: 1
>> [INFO] webservices-testsuite/jaxws-wsa-tests      RUNNING
>> [INFO] webservices-testsuite/jaxws-wsa-tests      SUCCESS (0:01:04.387)
>> [INFO] webservices-testsuite/saaj-tests           RUNNING
>> [INFO] webservices-testsuite/saaj-tests           SUCCESS (0:00:41.402)
>> [INFO] webservices-testsuite/stax-tests           RUNNING
>> [INFO] webservices-testsuite/stax-tests           SUCCESS (0:00:59.888)
>> [INFO]
>> [INFO]
>> -------------------------------------------------------------------------------
>> [INFO] Test Summary (0:36:49.111)
>> [INFO]     Passed: 31
>> [INFO]     Failed: 5
>> [INFO]
>> -------------------------------------------------------------------------------
>> [INFO]
>> [INFO] The following tests failed:
>> [INFO]     * console-testsuite/advanced -
>> /home/geronimo/geronimo/trunk/testsuite/console-testsuite/advanced/build.log
>> [INFO]     * enterprise-testsuite/sec-client -
>> /home/geronimo/geronimo/trunk/testsuite/enterprise-testsuite/sec-client/build.log
>> [INFO]     * enterprise-testsuite/sec-tests -
>> /home/geronimo/geronimo/trunk/testsuite/enterprise-testsuite/sec-tests/build.log
>> [INFO]     * web-testsuite/test-tomcat -
>> /home/geronimo/geronimo/trunk/testsuite/web-testsuite/test-tomcat/build.log
>> [INFO]     * webservices-testsuite/jaxws-tests -
>> /home/geronimo/geronimo/trunk/testsuite/webservices-testsuite/jaxws-tests/build.log
>> [INFO]
>> [INFO]
>> ------------------------------------------------------------------------
>> [ERROR] BUILD ERROR
>>
>> Assembly: jetty
>> =================================
>> See the full test.log file at
>> http://people.apache.org/builds/geronimo/server/binaries/trunk/20090620/logs-0900-jetty/test.log
>>
>>
>> [INFO] Installing assembly...
>> [INFO] Expanding:
>> /home/geronimo/.m2/repository/org/apache/geronimo/assemblies/geronimo-jetty7-javaee5/2.2-SNAPSHOT/geronimo-jetty7-javaee5-2.2-SNAPSHOT-bin.zip
>> into /home/geronimo/geronimo/trunk/testsuite/target
>> [INFO] Starting Geronimo server...
>> [INFO] Selected option set: default
>> [INFO] Redirecting output to:
>> /home/geronimo/geronimo/trunk/testsuite/target/geronimo-logs/org.apache.geronimo.mavenplugins.geronimo.server.StartServerMojo.log
>> [INFO] Waiting for Geronimo server...
>> [INFO] Geronimo server started in 0:00:45.921
>> [INFO] [shitty:install {execution: default}]
>> [INFO] Installing /home/geronimo/geronimo/trunk/testsuite/pom.xml to
>> /home/geronimo/.m2/repository/org/apache/geronimo/testsuite/testsuite/testing/testsuite-testing.pom
>> [INFO] [shitty:test {execution: default}]
>> [INFO] Starting 36 test builds
>> [INFO]
>> [INFO]
>> -------------------------------------------------------------------------------
>> [INFO]
>> [INFO] commands-testsuite/deploy                  RUNNING
>> [INFO] commands-testsuite/deploy                  SUCCESS (0:01:15.053)
>> [INFO] commands-testsuite/gshell                  RUNNING
>> [INFO] commands-testsuite/gshell                  SUCCESS (0:00:35.520)
>> [INFO] commands-testsuite/jaxws                   RUNNING
>> [INFO] commands-testsuite/jaxws                   SUCCESS (0:00:39.151)
>> [INFO] commands-testsuite/shutdown                RUNNING
>> [INFO] commands-testsuite/shutdown                SUCCESS (0:00:21.717)
>> [INFO] concurrent-testsuite/concurrent-basic      RUNNING
>> [INFO] concurrent-testsuite/concurrent-basic      SUCCESS (0:06:14.156)
>> [INFO] console-testsuite/advanced                 RUNNING
>> [INFO] console-testsuite/advanced                 FAILURE (0:00:21.646)
>> Java returned: 1
>> [INFO] console-testsuite/basic                    RUNNING
>> [INFO] console-testsuite/basic                    SUCCESS (0:02:11.015)
>> [INFO] corba-testsuite/corba-helloworld           RUNNING
>> [INFO] corba-testsuite/corba-helloworld           SUCCESS (0:00:51.998)
>> [INFO] corba-testsuite/corba-marshal              RUNNING
>> [INFO] corba-testsuite/corba-marshal              SUCCESS (0:01:01.815)
>> [INFO] corba-testsuite/corba-mytime               RUNNING
>> [INFO] corba-testsuite/corba-mytime               SUCCESS (0:00:48.413)
>> [INFO] deployment-testsuite/deployment-tests      RUNNING
>> [INFO] deployment-testsuite/deployment-tests      SUCCESS (0:00:34.399)
>> [INFO] deployment-testsuite/jca-cms-tests         RUNNING
>> [INFO] deployment-testsuite/jca-cms-tests         SUCCESS (0:00:34.819)
>> [INFO] deployment-testsuite/manifestcp-tests      RUNNING
>> [INFO] deployment-testsuite/manifestcp-tests      SUCCESS (0:00:38.196)
>> [INFO] enterprise-testsuite/ejb-tests             RUNNING
>> [INFO] enterprise-testsuite/ejb-tests             SUCCESS (0:00:47.148)
>> [INFO] enterprise-testsuite/jms-tests             RUNNING
>> [INFO] enterprise-testsuite/jms-tests             SUCCESS (0:01:02.368)
>> [INFO] enterprise-testsuite/jpa-tests             RUNNING
>> [INFO] enterprise-testsuite/jpa-tests             SUCCESS (0:00:46.663)
>> [INFO] enterprise-testsuite/sec-client            RUNNING
>> [INFO] enterprise-testsuite/sec-client            FAILURE (0:00:27.552)
>> Java returned: 1
>> [INFO] enterprise-testsuite/sec-tests             RUNNING
>> [INFO] enterprise-testsuite/sec-tests             FAILURE (0:00:38.542)
>> Java returned: 1
>> [INFO] security-testsuite/test-security           RUNNING
>> [INFO] security-testsuite/test-security           SUCCESS (0:00:50.688)
>> [INFO] web-testsuite/test-2.1-jsps                RUNNING
>> [INFO] web-testsuite/test-2.1-jsps                SUCCESS (0:00:33.645)
>> [INFO] web-testsuite/test-2.5-servlets            RUNNING
>> [INFO] web-testsuite/test-2.5-servlets            SUCCESS (0:00:32.102)
>> [INFO] web-testsuite/test-jetty                   RUNNING
>> [INFO] web-testsuite/test-jetty                   SUCCESS (0:00:25.333)
>> [INFO] web-testsuite/test-myfaces                 RUNNING
>> [INFO] web-testsuite/test-myfaces                 SUCCESS (0:00:33.891)
>> [INFO] web-testsuite/test-web-forward             RUNNING
>> [INFO] web-testsuite/test-web-forward             SUCCESS (0:00:38.531)
>> [INFO] web-testsuite/test-web-references          RUNNING
>> [INFO] web-testsuite/test-web-references          SUCCESS (0:00:44.342)
>> [INFO] webservices-testsuite/jaxb-tests           RUNNING
>> [INFO] webservices-testsuite/jaxb-tests           SUCCESS (0:01:08.406)
>> [INFO] webservices-testsuite/jaxr-tests           RUNNING
>> [INFO] webservices-testsuite/jaxr-tests           SUCCESS (0:01:01.606)
>> [INFO] webservices-testsuite/jaxrpc-jaxws-tests   RUNNING
>> [INFO] webservices-testsuite/jaxrpc-jaxws-tests   SUCCESS (0:00:35.390)
>> [INFO] webservices-testsuite/jaxrpc-tests         RUNNING
>> [INFO] webservices-testsuite/jaxrpc-tests         SUCCESS (0:00:48.992)
>> [INFO] webservices-testsuite/jaxws-catalog-tests  RUNNING
>> [INFO] webservices-testsuite/jaxws-catalog-tests  SUCCESS (0:00:56.650)
>> [INFO] webservices-testsuite/jaxws-mtom-tests     RUNNING
>> [INFO] webservices-testsuite/jaxws-mtom-tests     SUCCESS (0:00:55.977)
>> [INFO] webservices-testsuite/jaxws-provider-tests RUNNING
>> [INFO] webservices-testsuite/jaxws-provider-tests SUCCESS (0:01:05.194)
>> [INFO] webservices-testsuite/jaxws-tests          RUNNING
>> [INFO] webservices-testsuite/jaxws-tests          FAILURE (0:01:31.035)
>> Java returned: 1
>> [INFO] webservices-testsuite/jaxws-wsa-tests      RUNNING
>> [INFO] webservices-testsuite/jaxws-wsa-tests      SUCCESS (0:00:58.421)
>> [INFO] webservices-testsuite/saaj-tests           RUNNING
>> [INFO] webservices-testsuite/saaj-tests           SUCCESS (0:00:43.295)
>> [INFO] webservices-testsuite/stax-tests           RUNNING
>> [INFO] webservices-testsuite/stax-tests           SUCCESS (0:01:02.036)
>> [INFO]
>> [INFO]
>> -------------------------------------------------------------------------------
>> [INFO] Test Summary (0:34:55.907)
>> [INFO]     Passed: 32
>> [INFO]     Failed: 4
>> [INFO]
>> -------------------------------------------------------------------------------
>> [INFO]
>> [INFO] The following tests failed:
>> [INFO]     * console-testsuite/advanced -
>> /home/geronimo/geronimo/trunk/testsuite/console-testsuite/advanced/build.log
>> [INFO]     * enterprise-testsuite/sec-client -
>> /home/geronimo/geronimo/trunk/testsuite/enterprise-testsuite/sec-client/build.log
>> [INFO]     * enterprise-testsuite/sec-tests -
>> /home/geronimo/geronimo/trunk/testsuite/enterprise-testsuite/sec-tests/build.log
>> [INFO]     * webservices-testsuite/jaxws-tests -
>> /home/geronimo/geronimo/trunk/testsuite/webservices-testsuite/jaxws-tests/build.log
>> [INFO]
>> [INFO]
>> ------------------------------------------------------------------------
>> [ERROR] BUILD ERROR
>>
>> Samples: trunk
>> =================================
>> Log:
>> http://people.apache.org/builds/geronimo/server/binaries/trunk/20090620/samples-0900.log
>>
>> Build status: FAILED
>>
>
>
>
> --
> Ivan
>

Mime
View raw message