geronimo-dev mailing list archives

Site index · List index
Message view « Date » · « Thread »
Top « Date » · « Thread »
From ga...@apache.org
Subject [BUILD] trunk: Failed for Revision: 786191
Date Thu, 18 Jun 2009 19:42:15 GMT
Geronimo Revision: 786191 built with tests included
 
See the full build-1500.log file at http://people.apache.org/builds/geronimo/server/binaries/trunk/20090618/build-1500.log
 
Download the binaries from http://people.apache.org/builds/geronimo/server/binaries/trunk/20090618
[INFO] BUILD SUCCESSFUL
[INFO] ------------------------------------------------------------------------
[INFO] Total time: 40 minutes 28 seconds
[INFO] Finished at: Thu Jun 18 15:43:38 EDT 2009
[INFO] Final Memory: 406M/1013M
[INFO] ------------------------------------------------------------------------
 
TESTSUITE RESULTS (Failures only)
=================================
See detailed results at http://people.apache.org/builds/geronimo/server/testsuite/ResultsSummary.html
 
Assembly: tomcat
=================================
See the full test.log file at http://people.apache.org/builds/geronimo/server/binaries/trunk/20090618/logs-1500-tomcat/test.log
 
 
[INFO] Installing /home/geronimo/geronimo/trunk/testsuite/pom.xml to /home/geronimo/.m2/repository/org/apache/geronimo/testsuite/testsuite/testing/testsuite-testing.pom
[INFO] [shitty:test {execution: default}]
[INFO] Starting 36 test builds
[INFO] 
[INFO] -------------------------------------------------------------------------------
[INFO] 
[INFO] commands-testsuite/deploy                  RUNNING
[INFO] commands-testsuite/deploy                  SUCCESS (0:01:16.829) 
[INFO] commands-testsuite/gshell                  RUNNING
[INFO] commands-testsuite/gshell                  SUCCESS (0:00:34.743) 
[INFO] commands-testsuite/jaxws                   RUNNING
[INFO] commands-testsuite/jaxws                   FAILURE (0:00:34.581) Java returned: 1
[INFO] commands-testsuite/shutdown                RUNNING
[INFO] commands-testsuite/shutdown                SUCCESS (0:00:22.016) 
[INFO] concurrent-testsuite/concurrent-basic      RUNNING
[INFO] concurrent-testsuite/concurrent-basic      SUCCESS (0:06:27.472) 
[INFO] console-testsuite/advanced                 RUNNING
[INFO] console-testsuite/advanced                 FAILURE (0:01:26.795) Java returned: 1
[INFO] console-testsuite/basic                    RUNNING
[INFO] console-testsuite/basic                    SUCCESS (0:01:59.901) 
[INFO] corba-testsuite/corba-helloworld           RUNNING
[INFO] corba-testsuite/corba-helloworld           SUCCESS (0:00:52.581) 
[INFO] corba-testsuite/corba-marshal              RUNNING
[INFO] corba-testsuite/corba-marshal              SUCCESS (0:01:27.739) 
[INFO] corba-testsuite/corba-mytime               RUNNING
[INFO] corba-testsuite/corba-mytime               SUCCESS (0:00:45.739) 
[INFO] deployment-testsuite/deployment-tests      RUNNING
[INFO] deployment-testsuite/deployment-tests      SUCCESS (0:00:33.828) 
[INFO] deployment-testsuite/jca-cms-tests         RUNNING
[INFO] deployment-testsuite/jca-cms-tests         SUCCESS (0:00:34.678) 
[INFO] deployment-testsuite/manifestcp-tests      RUNNING
[INFO] deployment-testsuite/manifestcp-tests      SUCCESS (0:00:36.885) 
[INFO] enterprise-testsuite/ejb-tests             RUNNING
[INFO] enterprise-testsuite/ejb-tests             SUCCESS (0:01:13.314) 
[INFO] enterprise-testsuite/jms-tests             RUNNING
[INFO] enterprise-testsuite/jms-tests             SUCCESS (0:00:58.928) 
[INFO] enterprise-testsuite/jpa-tests             RUNNING
[INFO] enterprise-testsuite/jpa-tests             SUCCESS (0:00:50.902) 
[INFO] enterprise-testsuite/sec-client            RUNNING
[INFO] enterprise-testsuite/sec-client            FAILURE (0:00:25.562) Java returned: 1
[INFO] enterprise-testsuite/sec-tests             RUNNING
[INFO] enterprise-testsuite/sec-tests             FAILURE (0:00:37.655) Java returned: 1
[INFO] security-testsuite/test-security           RUNNING
[INFO] security-testsuite/test-security           SUCCESS (0:00:49.897) 
[INFO] web-testsuite/test-2.1-jsps                RUNNING
[INFO] web-testsuite/test-2.1-jsps                SUCCESS (0:00:33.441) 
[INFO] web-testsuite/test-2.5-servlets            RUNNING
[INFO] web-testsuite/test-2.5-servlets            SUCCESS (0:00:31.266) 
[INFO] web-testsuite/test-myfaces                 RUNNING
[INFO] web-testsuite/test-myfaces                 SUCCESS (0:00:32.868) 
[INFO] web-testsuite/test-tomcat                  RUNNING
[INFO] web-testsuite/test-tomcat                  FAILURE (0:00:19.740) Java returned: 1
[INFO] web-testsuite/test-web-forward             RUNNING
[INFO] web-testsuite/test-web-forward             SUCCESS (0:00:38.179) 
[INFO] web-testsuite/test-web-references          RUNNING
[INFO] web-testsuite/test-web-references          SUCCESS (0:00:42.853) 
[INFO] webservices-testsuite/jaxb-tests           RUNNING
[INFO] webservices-testsuite/jaxb-tests           FAILURE (0:00:02.695) Java returned: 1
[INFO] webservices-testsuite/jaxr-tests           RUNNING
[INFO] webservices-testsuite/jaxr-tests           SUCCESS (0:00:59.160) 
[INFO] webservices-testsuite/jaxrpc-jaxws-tests   RUNNING
[INFO] webservices-testsuite/jaxrpc-jaxws-tests   FAILURE (0:00:02.756) Java returned: 1
[INFO] webservices-testsuite/jaxrpc-tests         RUNNING
[INFO] webservices-testsuite/jaxrpc-tests         SUCCESS (0:00:49.727) 
[INFO] webservices-testsuite/jaxws-catalog-tests  RUNNING
[INFO] webservices-testsuite/jaxws-catalog-tests  FAILURE (0:00:01.975) Java returned: 1
[INFO] webservices-testsuite/jaxws-mtom-tests     RUNNING
[INFO] webservices-testsuite/jaxws-mtom-tests     FAILURE (0:00:02.052) Java returned: 1
[INFO] webservices-testsuite/jaxws-provider-tests RUNNING
[INFO] webservices-testsuite/jaxws-provider-tests FAILURE (0:00:02.690) Java returned: 1
[INFO] webservices-testsuite/jaxws-tests          RUNNING
[INFO] webservices-testsuite/jaxws-tests          FAILURE (0:00:01.972) Java returned: 1
[INFO] webservices-testsuite/jaxws-wsa-tests      RUNNING
[INFO] webservices-testsuite/jaxws-wsa-tests      FAILURE (0:00:01.972) Java returned: 1
[INFO] webservices-testsuite/saaj-tests           RUNNING
[INFO] webservices-testsuite/saaj-tests           SUCCESS (0:00:40.788) 
[INFO] webservices-testsuite/stax-tests           RUNNING
[INFO] webservices-testsuite/stax-tests           SUCCESS (0:00:59.832) 
[INFO] 
[INFO] -------------------------------------------------------------------------------
[INFO] Test Summary (0:29:34.217)
[INFO]     Passed: 24
[INFO]     Failed: 12
[INFO] -------------------------------------------------------------------------------
[INFO] 
[INFO] The following tests failed:
[INFO]     * commands-testsuite/jaxws - /home/geronimo/geronimo/trunk/testsuite/commands-testsuite/jaxws/build.log
[INFO]     * console-testsuite/advanced - /home/geronimo/geronimo/trunk/testsuite/console-testsuite/advanced/build.log
[INFO]     * enterprise-testsuite/sec-client - /home/geronimo/geronimo/trunk/testsuite/enterprise-testsuite/sec-client/build.log
[INFO]     * enterprise-testsuite/sec-tests - /home/geronimo/geronimo/trunk/testsuite/enterprise-testsuite/sec-tests/build.log
[INFO]     * web-testsuite/test-tomcat - /home/geronimo/geronimo/trunk/testsuite/web-testsuite/test-tomcat/build.log
[INFO]     * webservices-testsuite/jaxb-tests - /home/geronimo/geronimo/trunk/testsuite/webservices-testsuite/jaxb-tests/build.log
[INFO]     * webservices-testsuite/jaxrpc-jaxws-tests - /home/geronimo/geronimo/trunk/testsuite/webservices-testsuite/jaxrpc-jaxws-tests/build.log
[INFO]     * webservices-testsuite/jaxws-catalog-tests - /home/geronimo/geronimo/trunk/testsuite/webservices-testsuite/jaxws-catalog-tests/build.log
[INFO]     * webservices-testsuite/jaxws-mtom-tests - /home/geronimo/geronimo/trunk/testsuite/webservices-testsuite/jaxws-mtom-tests/build.log
[INFO]     * webservices-testsuite/jaxws-provider-tests - /home/geronimo/geronimo/trunk/testsuite/webservices-testsuite/jaxws-provider-tests/build.log
[INFO]     * webservices-testsuite/jaxws-tests - /home/geronimo/geronimo/trunk/testsuite/webservices-testsuite/jaxws-tests/build.log
[INFO]     * webservices-testsuite/jaxws-wsa-tests - /home/geronimo/geronimo/trunk/testsuite/webservices-testsuite/jaxws-wsa-tests/build.log
[INFO] 
[INFO] ------------------------------------------------------------------------
[ERROR] BUILD ERROR
 
Assembly: jetty
=================================
See the full test.log file at http://people.apache.org/builds/geronimo/server/binaries/trunk/20090618/logs-1500-jetty/test.log
 
 
Booting Geronimo Kernel (in Java 1.5.0_12)...
Module  1/74 org.apache.geronimo.framework/j2ee-system/2.2-SNAPSHOT/car                  
                    started in   .000s
Module  2/74 org.apache.geronimo.framework/jee-specs/2.2-SNAPSHOT/car                    
                    started in   .001s
Module  3/74 org.apache.geronimo.plugins.classloaders/xbean-finder/2.2-SNAPSHOT/car      
                    started in   .000s
Module  4/74 org.apache.geronimo.framework/xmlbeans/2.2-SNAPSHOT/car                     
                    started in   .000s
Module  5/74 org.apache.geronimo.framework/rmi-naming/2.2-SNAPSHOT/car                   
                    started in   .212s
Module  6/74 org.apache.geronimo.plugins.classloaders/geronimo-javaee-deployment_1.1MR3_spec/2.2-SNAPSHOT/car
started in   .000s
Module  7/74 org.apache.geronimo.framework/plugin/2.2-SNAPSHOT/car                       
                    started in   .822s
Module  8/74 org.apache.geronimo.framework/geronimo-gbean-deployer/2.2-SNAPSHOT/car      
                    started in   .394s
Module  9/74 org.apache.geronimo.configs/j2ee-server/2.2-SNAPSHOT/car                    
                    started in   .064s
Module 10/74 org.apache.geronimo.framework/j2ee-security/2.2-SNAPSHOT/car                
                    started in   .273s
Module 11/74 org.apache.geronimo.framework/server-security-config/2.2-SNAPSHOT/car       
                    started in   .053s
Module 12/74 org.apache.geronimo.plugins.classloaders/geronimo-schema-jee_5/2.2-SNAPSHOT/car
                 started in   .000s
Module 13/74 org.apache.geronimo.configs/j2ee-deployer/2.2-SNAPSHOT/car                  
                    started in   .261s
Module 14/74 org.apache.geronimo.configs/client-deployer/2.2-SNAPSHOT/car                
                    started in   .068s
Module 15/74 org.apache.geronimo.configs/aspectj/2.2-SNAPSHOT/car                        
                    started in   .027s
Module 16/74 org.apache.geronimo.configs/clustering/2.2-SNAPSHOT/car                     
                    started in   .117s
Module 17/74 org.apache.geronimo.configs/transaction/2.2-SNAPSHOT/car                    
                    started in   .450s
Module 18/74 org.apache.geronimo.configs/connector-deployer/2.2-SNAPSHOT/car             
                    started in   .151s
Module 19/74 org.apache.geronimo.configs/derby/2.2-SNAPSHOT/car                          
                    started in   .000s
Module 20/74 org.apache.geronimo.configs/system-database/2.2-SNAPSHOT/car                
                    started in  5.298s
Module 21/74 org.apache.geronimo.configs/openjpa/2.2-SNAPSHOT/car                        
                    started in   .012s
Module 22/74 org.apache.geronimo.configs/webservices-common/2.2-SNAPSHOT/car             
                    started in   .000s
Module 23/74 org.apache.geronimo.configs/openejb/2.2-SNAPSHOT/car                        
                    started in  1.057s
Module 24/74 org.apache.geronimo.configs/openejb-deployer/2.2-SNAPSHOT/car               
                    started in   .113s
Module 25/74 org.apache.geronimo.configs/openejb-clustering-builder-wadi/2.2-SNAPSHOT/car
                    started in   .935s
Module 26/74 org.apache.geronimo.configs/jetty7/2.2-SNAPSHOT/car                         
                    started in   .460s
Module 27/74 org.apache.geronimo.configs/jetty7-deployer/2.2-SNAPSHOT/car                
                    started in   .154s
Module 28/74 org.apache.geronimo.configs/jetty7-clustering-builder-wadi/2.2-SNAPSHOT/car 
                    started in   .124s
Module 29/74 org.apache.geronimo.configs/openejb-corba-deployer/2.2-SNAPSHOT/car         
                    started in   .142s
Module 30/74 org.apache.geronimo.configs/j2ee-corba-yoko/2.2-SNAPSHOT/car                
                    started in   .854s
Module 31/74 org.apache.geronimo.configs/mejb/2.2-SNAPSHOT/car                           
                    started in   .301s
Module 32/74 org.apache.geronimo.framework/transformer-agent/2.2-SNAPSHOT/car            
                    started in   .000s
Module 33/74 org.apache.geronimo.framework/gshell-framework/2.2-SNAPSHOT/car             
                    started in   .000s
Module 34/74 org.apache.geronimo.framework/gshell-geronimo/2.2-SNAPSHOT/car              
                    started in   .000s
Module 35/74 org.apache.geronimo.framework/gshell-remote/2.2-SNAPSHOT/car                
                    started in   .000s
Module 36/74 org.apache.geronimo.configs/persistence-jpa10-deployer/2.2-SNAPSHOT/car     
                    started in   .081s
Module 37/74 org.apache.geronimo.configs/hot-deployer/2.2-SNAPSHOT/car                   
                    started in   .421s
Module 38/74 org.apache.geronimo.configs/jasper/2.2-SNAPSHOT/car                         
                    started in   .003s
Module 39/74 org.apache.geronimo.configs/remote-deploy-jetty/2.2-SNAPSHOT/car            
                    started in   .418s
Module 40/74 org.apache.geronimo.configs/jasper-deployer/2.2-SNAPSHOT/car                
                    started in   .023s
Module 41/74 org.apache.geronimo.configs/sharedlib/2.2-SNAPSHOT/car                      
                    started in   .007s
Module 42/74 org.apache.geronimo.configs/axis/2.2-SNAPSHOT/car                           
                    started in   .162s
Module 43/74 org.apache.geronimo.configs/axis-deployer/2.2-SNAPSHOT/car                  
                    started in   .128s
Module 44/74 org.apache.geronimo.configs/jaxws-deployer/2.2-SNAPSHOT/car                 
                    started in   .000s
Module 45/74 org.apache.geronimo.configs/jaxws-ejb-deployer/2.2-SNAPSHOT/car             
                    started in   .000s
Module 46/74 org.apache.geronimo.configs/jaxws-sun-tools/2.2-SNAPSHOT/car                
                    started in   .038s
Module 47/74 org.apache.geronimo.configs/jaxws-tools/2.2-SNAPSHOT/car                    
                    started in   .000s
Module 48/74 org.apache.geronimo.configs/spring/2.2-SNAPSHOT/car                         
                    started in   .000s
Module 49/74 org.apache.geronimo.configs/cxf-deployer/2.2-SNAPSHOT/car                   
                    started in   .086s
Module 50/74 org.apache.geronimo.configs/cxf-ejb-deployer/2.2-SNAPSHOT/car               
                    started in   .184s
Module 51/74 org.apache.geronimo.configs/concurrent/2.2-SNAPSHOT/car                     
                    started in   .114s
Module 52/74 org.apache.geronimo.configs/concurrent-deployer/2.2-SNAPSHOT/car            
                    started in   .028s
Module 53/74 org.apache.geronimo.configs/javamail/2.2-SNAPSHOT/car                       
                    started in   .044s
Module 54/74 org.apache.geronimo.configs/uddi-jetty6/2.2-SNAPSHOT/car                    
                    started in   .630s
Module 55/74 org.apache.geronimo.configs/welcome-jetty/2.2-SNAPSHOT/car                  
                    started in   .142s
Module 56/74 org.apache.geronimo.plugins/pluto-support/2.2-SNAPSHOT/car                  
                    started in   .020s
Module 57/74 org.apache.geronimo.plugins/console-jetty/2.2-SNAPSHOT/car                  
                    started in  4.437s
Module 58/74 org.apache.geronimo.configs/dojo-legacy-jetty6/2.2-SNAPSHOT/car             
                   2009-06-18 16:25:32,160 ERROR [GBeanInstanceState] Error while starting;
GBean is now in the FAILED state: abstractName="org.apache.geronimo.configs/dojo-legacy-jetty6/2.2-SNAPSHOT/car?J2EEApplication=null,j2eeType=WebModule,name=org.apache.geronimo.configs/dojo-legacy-jetty6/2.2-SNAPSHOT/car"
java.lang.IllegalArgumentException: Bad temp directory: /home/geronimo/geronimo/trunk/testsuite/target/geronimo-jetty6-javaee5-2.2-SNAPSHOT/var/jetty/dojo/0.4
	at org.eclipse.jetty.webapp.WebAppContext.setTempDirectory(WebAppContext.java:852)
	at org.apache.geronimo.jetty7.JettyWebAppContext.<init>(JettyWebAppContext.java:198)
	at sun.reflect.NativeConstructorAccessorImpl.newInstance0(Native Method)
	at sun.reflect.NativeConstructorAccessorImpl.newInstance(NativeConstructorAccessorImpl.java:39)
	at sun.reflect.DelegatingConstructorAccessorImpl.newInstance(DelegatingConstructorAccessorImpl.java:27)
	at java.lang.reflect.Constructor.newInstance(Constructor.java:494)
	at org.apache.xbean.recipe.ReflectionUtil$ConstructorFactory.create(ReflectionUtil.java:952)
	at org.apache.xbean.recipe.ObjectRecipe.internalCreate(ObjectRecipe.java:276)
	at org.apache.xbean.recipe.AbstractRecipe.create(AbstractRecipe.java:96)
	at org.apache.xbean.recipe.AbstractRecipe.create(AbstractRecipe.java:61)
	at org.apache.geronimo.gbean.runtime.GBeanInstance.createInstance(GBeanInstance.java:910)
	at org.apache.geronimo.gbean.runtime.GBeanInstanceState.attemptFullStart(GBeanInstanceState.java:269)
	at org.apache.geronimo.gbean.runtime.GBeanInstanceState.start(GBeanInstanceState.java:103)
	at org.apache.geronimo.gbean.runtime.GBeanInstanceState.startRecursive(GBeanInstanceState.java:125)
	at org.apache.geronimo.gbean.runtime.GBeanInstance.startRecursive(GBeanInstance.java:538)
	at org.apache.geronimo.kernel.basic.BasicKernel.startRecursiveGBean(BasicKernel.java:377)
	at org.apache.geronimo.kernel.config.ConfigurationUtil.startConfigurationGBeans(ConfigurationUtil.java:456)
	at org.apache.geronimo.kernel.config.KernelConfigurationManager.start(KernelConfigurationManager.java:190)
	at org.apache.geronimo.kernel.config.SimpleConfigurationManager.startConfiguration(SimpleConfigurationManager.java:546)
	at sun.reflect.GeneratedMethodAccessor22.invoke(Unknown Source)
	at sun.reflect.DelegatingMethodAccessorImpl.invoke(DelegatingMethodAccessorImpl.java:25)
	at java.lang.reflect.Method.invoke(Method.java:585)
	at org.apache.geronimo.gbean.runtime.ReflectionMethodInvoker.invoke(ReflectionMethodInvoker.java:34)
	at org.apache.geronimo.gbean.runtime.GBeanOperation.invoke(GBeanOperation.java:130)
	at org.apache.geronimo.gbean.runtime.GBeanInstance.invoke(GBeanInstance.java:815)
	at org.apache.geronimo.gbean.runtime.RawInvoker.invoke(RawInvoker.java:57)
	at org.apache.geronimo.kernel.basic.RawOperationInvoker.invoke(RawOperationInvoker.java:35)
	at org.apache.geronimo.kernel.basic.ProxyMethodInterceptor.intercept(ProxyMethodInterceptor.java:96)
	at org.apache.geronimo.kernel.config.EditableConfigurationManager$$EnhancerByCGLIB$$989c7ac0.startConfiguration(<generated>)
	at org.apache.geronimo.system.main.EmbeddedDaemon.doStartup(EmbeddedDaemon.java:161)
	at org.apache.geronimo.system.main.EmbeddedDaemon.execute(EmbeddedDaemon.java:78)
	at org.apache.geronimo.kernel.util.MainConfigurationBootstrapper.main(MainConfigurationBootstrapper.java:45)
	at org.apache.geronimo.cli.AbstractCLI.executeMain(AbstractCLI.java:65)
	at org.apache.geronimo.cli.daemon.DaemonCLI.main(DaemonCLI.java:30)
Server Startup failed

org.apache.geronimo.kernel.config.LifecycleException: start of org.apache.geronimo.configs/dojo-legacy-jetty6/2.2-SNAPSHOT/car
failed
	at org.apache.geronimo.kernel.config.SimpleConfigurationManager.startConfiguration(SimpleConfigurationManager.java:562)
	at sun.reflect.GeneratedMethodAccessor22.invoke(Unknown Source)
	at sun.reflect.DelegatingMethodAccessorImpl.invoke(DelegatingMethodAccessorImpl.java:25)
	at java.lang.reflect.Method.invoke(Method.java:585)
	at org.apache.geronimo.gbean.runtime.ReflectionMethodInvoker.invoke(ReflectionMethodInvoker.java:34)
	at org.apache.geronimo.gbean.runtime.GBeanOperation.invoke(GBeanOperation.java:130)
	at org.apache.geronimo.gbean.runtime.GBeanInstance.invoke(GBeanInstance.java:815)
	at org.apache.geronimo.gbean.runtime.RawInvoker.invoke(RawInvoker.java:57)
	at org.apache.geronimo.kernel.basic.RawOperationInvoker.invoke(RawOperationInvoker.java:35)
	at org.apache.geronimo.kernel.basic.ProxyMethodInterceptor.intercept(ProxyMethodInterceptor.java:96)
	at org.apache.geronimo.kernel.config.EditableConfigurationManager$$EnhancerByCGLIB$$989c7ac0.startConfiguration(<generated>)
	at org.apache.geronimo.system.main.EmbeddedDaemon.doStartup(EmbeddedDaemon.java:161)
	at org.apache.geronimo.system.main.EmbeddedDaemon.execute(EmbeddedDaemon.java:78)
	at org.apache.geronimo.kernel.util.MainConfigurationBootstrapper.main(MainConfigurationBootstrapper.java:45)
	at org.apache.geronimo.cli.AbstractCLI.executeMain(AbstractCLI.java:65)
	at org.apache.geronimo.cli.daemon.DaemonCLI.main(DaemonCLI.java:30)
Caused by: org.apache.geronimo.kernel.config.InvalidConfigException: Unknown start exception
	at org.apache.geronimo.kernel.config.ConfigurationUtil.startConfigurationGBeans(ConfigurationUtil.java:522)
	at org.apache.geronimo.kernel.config.KernelConfigurationManager.start(KernelConfigurationManager.java:190)
	at org.apache.geronimo.kernel.config.SimpleConfigurationManager.startConfiguration(SimpleConfigurationManager.java:546)
	... 15 more
Caused by: org.apache.geronimo.gbean.InvalidConfigurationException: Configuration org.apache.geronimo.configs/dojo-legacy-jetty6/2.2-SNAPSHOT/car
failed to start due to the following reasons:
  The service J2EEApplication=null,j2eeType=WebModule,name=org.apache.geronimo.configs/dojo-legacy-jetty6/2.2-SNAPSHOT/car
did not start because Bad temp directory: /home/geronimo/geronimo/trunk/testsuite/target/geronimo-jetty6-javaee5-2.2-SNAPSHOT/var/jetty/dojo/0.4
  The service J2EEApplication=null,WebModule=org.apache.geronimo.configs/dojo-legacy-jetty6/2.2-SNAPSHOT/car,j2eeType=Servlet,name=jsp
did not start because org.apache.geronimo.configs/dojo-legacy-jetty6/2.2-SNAPSHOT/car?J2EEApplication=null,j2eeType=WebModule,name=org.apache.geronimo.configs/dojo-legacy-jetty6/2.2-SNAPSHOT/car
did not start.
  The service J2EEApplication=null,WebModule=org.apache.geronimo.configs/dojo-legacy-jetty6/2.2-SNAPSHOT/car,j2eeType=Servlet,name=default
did not start because org.apache.geronimo.configs/dojo-legacy-jetty6/2.2-SNAPSHOT/car?J2EEApplication=null,j2eeType=WebModule,name=org.apache.geronimo.configs/dojo-legacy-jetty6/2.2-SNAPSHOT/car
did not start.

	at org.apache.geronimo.kernel.config.ConfigurationUtil.startConfigurationGBeans(ConfigurationUtil.java:485)
	... 17 more
 
[INFO] Scanning for projects...
[INFO] ------------------------------------------------------------------------
[INFO] Building Geronimo TestSuite
[INFO]    task-segment: [install]
[INFO] ------------------------------------------------------------------------
[INFO] [genesis:validate-configuration {execution: default}]
[INFO] [enforcer:enforce {execution: default}]
[INFO] [shitty:clean {execution: default}]
[INFO] Setting property: classpath.resource.loader.class => 'org.codehaus.plexus.velocity.ContextClassLoaderResourceLoader'.
[INFO] Setting property: velocimacro.messages.on => 'false'.
[INFO] Setting property: resource.loader => 'classpath'.
[INFO] Setting property: resource.manager.logwhenfound => 'false'.
[INFO] [remote-resources:process {execution: default}]
[INFO] [selenium:xvfb {execution: xvfb}]
[INFO] Starting Xvfb...
[INFO] Using display: :21
[INFO] Using Xauthority file: /tmp/Xvfb31311.Xauthority
Deleting: /tmp/Xvfb31311.Xauthority
/usr/bin/xauth:  creating new authority file /tmp/Xvfb31311.Xauthority
Created dir: /home/geronimo/geronimo/trunk/testsuite/target/selenium
Launching Xvfb
[INFO] Redirecting output to: /home/geronimo/geronimo/trunk/testsuite/target/selenium/xvfb.log
Waiting for Xvfb...
Xvfb started
[INFO] [site:attach-descriptor]
[INFO] [selenium:start-server {execution: start}]
Launching Selenium Server
Waiting for Selenium Server...
[INFO] Including display properties from: /home/geronimo/geronimo/trunk/testsuite/target/selenium/display.properties
[INFO] Redirecting output to: /home/geronimo/geronimo/trunk/testsuite/target/selenium/server.log
[INFO] User extensions: /home/geronimo/geronimo/trunk/testsuite/target/selenium/user-extensions.js
Selenium Server started
[INFO] [geronimo:start-server {execution: start}]
[INFO] Using assembly configuration: jetty
[INFO] snapshot org.apache.geronimo.assemblies:geronimo-jetty6-javaee5:2.2-SNAPSHOT: checking
for updates from codehaus.snapshots
[INFO] snapshot org.apache.geronimo.assemblies:geronimo-jetty6-javaee5:2.2-SNAPSHOT: checking
for updates from apache.snapshots
[INFO] Using assembly artifact: org.apache.geronimo.assemblies:geronimo-jetty6-javaee5:zip:bin:2.2-SNAPSHOT:provided
[INFO] Using geronimoHome: /home/geronimo/geronimo/trunk/testsuite/target/geronimo-jetty6-javaee5-2.2-SNAPSHOT
[INFO] Installing assembly...
[INFO] Expanding: /home/geronimo/.m2/repository/org/apache/geronimo/assemblies/geronimo-jetty6-javaee5/2.2-SNAPSHOT/geronimo-jetty6-javaee5-2.2-SNAPSHOT-bin.zip
into /home/geronimo/geronimo/trunk/testsuite/target
[INFO] Starting Geronimo server...
[INFO] Selected option set: default
[INFO] Redirecting output to: /home/geronimo/geronimo/trunk/testsuite/target/geronimo-logs/org.apache.geronimo.mavenplugins.geronimo.server.StartServerMojo.log
[INFO] Waiting for Geronimo server...
[INFO] ------------------------------------------------------------------------
[ERROR] BUILD ERROR
 
Samples: trunk
=================================
Log: http://people.apache.org/builds/geronimo/server/binaries/trunk/20090618/samples-1500.log
 
Build status: FAILED
 

Mime
View raw message