geronimo-dev mailing list archives

Site index · List index
Message view « Date » · « Thread »
Top « Date » · « Thread »
From ga...@apache.org
Subject [BUILD] trunk: Failed for Revision: 767900
Date Thu, 23 Apr 2009 12:42:02 GMT
Geronimo Revision: 767900 built with tests included
 
See the full build-0900.log file at http://people.apache.org/builds/geronimo/server/binaries/trunk/20090423/build-0900.log
 
 
See the unit test reports at http://people.apache.org/builds/geronimo/server/binaries/trunk/20090423/unit-test-reports
 
[INFO] [car:prepare-plan]
[INFO] Generated: /home/geronimo/geronimo/trunk/plugins/myfaces/myfaces-deployer/target/resources/META-INF/plan.xml
[INFO] [car:verify-no-dependency-change]
[INFO] [car:package]
[INFO] Packaging module configuration: /home/geronimo/geronimo/trunk/plugins/myfaces/myfaces-deployer/target/resources/META-INF/plan.xml
[INFO] Started deployer: org.apache.geronimo.framework/geronimo-gbean-deployer/2.2-SNAPSHOT/car
[INFO] [car:prepare-metadata]
[INFO] [car:archive-car]
[INFO] Building jar: /home/geronimo/geronimo/trunk/plugins/myfaces/myfaces-deployer/target/myfaces-deployer-2.2-SNAPSHOT.car
[INFO] [ianal:verify-legal-files {execution: default}]
[INFO] Checking legal files in: myfaces-deployer-2.2-SNAPSHOT.car
[INFO] [install:install]
[INFO] Installing /home/geronimo/geronimo/trunk/plugins/myfaces/myfaces-deployer/target/myfaces-deployer-2.2-SNAPSHOT.car
to /home/geronimo/.m2/repository/org/apache/geronimo/configs/myfaces-deployer/2.2-SNAPSHOT/myfaces-deployer-2.2-SNAPSHOT.car
[INFO] [car:update-pluginlist]
[INFO] ------------------------------------------------------------------------
[INFO] Building Geronimo Plugins, OpenEJB :: Clustering over WADI
[INFO]    task-segment: [install]
[INFO] ------------------------------------------------------------------------
[INFO] [enforcer:enforce {execution: default}]
[INFO] [remote-resources:process {execution: process}]
[INFO] [remote-resources:process {execution: default}]
[INFO] [resources:resources]
[INFO] Using 'UTF-8' encoding to copy filtered resources.
[INFO] Copying 1 resource
[INFO] Copying 3 resources
[INFO] Copying 3 resources
[INFO] [compiler:compile]
[INFO] Compiling 9 source files to /home/geronimo/geronimo/trunk/plugins/openejb/geronimo-openejb-clustering-wadi/target/classes
[INFO] [resources:testResources]
[INFO] Using 'UTF-8' encoding to copy filtered resources.
[INFO] skip non existing resourceDirectory /home/geronimo/geronimo/trunk/plugins/openejb/geronimo-openejb-clustering-wadi/src/test/resources
[INFO] Copying 3 resources
[INFO] Copying 3 resources
[INFO] [compiler:testCompile]
[INFO] Compiling 4 source files to /home/geronimo/geronimo/trunk/plugins/openejb/geronimo-openejb-clustering-wadi/target/test-classes
[INFO] ------------------------------------------------------------------------
[ERROR] BUILD FAILURE
[INFO] ------------------------------------------------------------------------
[INFO] Compilation failure

/home/geronimo/geronimo/trunk/plugins/openejb/geronimo-openejb-clustering-wadi/src/test/java/org/apache/geronimo/openejb/cluster/stateful/container/ClusteredStatefulContainerTest.java:[105,21]
businessMethod(org.apache.openejb.core.CoreDeploymentInfo,java.lang.Object,java.lang.Class,java.lang.reflect.Method,java.lang.Object[],org.apache.openejb.InterfaceType)
in org.apache.openejb.core.stateful.StatefulContainer cannot be applied to (org.apache.openejb.core.CoreDeploymentInfo,java.lang.String,java.lang.Class<java.lang.Runnable>,java.lang.reflect.Method,java.lang.Object[])

/home/geronimo/geronimo/trunk/plugins/openejb/geronimo-openejb-clustering-wadi/src/test/java/org/apache/geronimo/openejb/cluster/stateful/container/ClusteredStatefulContainerTest.java:[114,21]
removeEJBObject(org.apache.openejb.core.CoreDeploymentInfo,java.lang.Object,java.lang.Class,java.lang.reflect.Method,java.lang.Object[],org.apache.openejb.InterfaceType)
in org.apache.openejb.core.stateful.StatefulContainer cannot be applied to (org.apache.openejb.core.CoreDeploymentInfo,java.lang.String,java.lang.Class<java.lang.Runnable>,java.lang.reflect.Method,java.lang.Object[])

/home/geronimo/geronimo/trunk/plugins/openejb/geronimo-openejb-clustering-wadi/src/test/java/org/apache/geronimo/openejb/cluster/stateful/container/ClusteredStatefulContainerTest.java:[124,25]
businessMethod(org.apache.openejb.core.CoreDeploymentInfo,java.lang.Object,java.lang.Class,java.lang.reflect.Method,java.lang.Object[],org.apache.openejb.InterfaceType)
in org.apache.openejb.core.stateful.StatefulContainer cannot be applied to (org.apache.openejb.core.CoreDeploymentInfo,java.lang.String,java.lang.Class<java.lang.Runnable>,java.lang.reflect.Method,java.lang.Object[])

/home/geronimo/geronimo/trunk/plugins/openejb/geronimo-openejb-clustering-wadi/src/test/java/org/apache/geronimo/openejb/cluster/stateful/container/ClusteredStatefulContainerTest.java:[128,25]
cannot find symbol
symbol  : method superBusinessMethod(org.apache.openejb.core.CoreDeploymentInfo,java.lang.String,java.lang.Class<java.lang.Runnable>,java.lang.reflect.Method,java.lang.Object[])
location: class org.apache.geronimo.openejb.cluster.stateful.container.ClusteredStatefulContainer

/home/geronimo/geronimo/trunk/plugins/openejb/geronimo-openejb-clustering-wadi/src/test/java/org/apache/geronimo/openejb/cluster/stateful/container/ClusteredStatefulContainerTest.java:[137,25]
removeEJBObject(org.apache.openejb.core.CoreDeploymentInfo,java.lang.Object,java.lang.Class,java.lang.reflect.Method,java.lang.Object[],org.apache.openejb.InterfaceType)
in org.apache.openejb.core.stateful.StatefulContainer cannot be applied to (org.apache.openejb.core.CoreDeploymentInfo,java.lang.String,java.lang.Class<java.lang.Runnable>,java.lang.reflect.Method,java.lang.Object[])

/home/geronimo/geronimo/trunk/plugins/openejb/geronimo-openejb-clustering-wadi/src/test/java/org/apache/geronimo/openejb/cluster/stateful/container/ClusteredStatefulContainerTest.java:[141,25]
cannot find symbol
symbol  : method superRemoveEJBObject(org.apache.openejb.core.CoreDeploymentInfo,java.lang.String,java.lang.Class<java.lang.Runnable>,java.lang.reflect.Method,java.lang.Object[])
location: class org.apache.geronimo.openejb.cluster.stateful.container.ClusteredStatefulContainer

/home/geronimo/geronimo/trunk/plugins/openejb/geronimo-openejb-clustering-wadi/src/test/java/org/apache/geronimo/openejb/cluster/stateful/container/ClusteredStatefulContainerTest.java:[175,32]
businessMethod(org.apache.openejb.core.CoreDeploymentInfo,java.lang.Object,java.lang.Class,java.lang.reflect.Method,java.lang.Object[],org.apache.openejb.InterfaceType)
in org.apache.openejb.core.stateful.StatefulContainer cannot be applied to (org.apache.openejb.core.CoreDeploymentInfo,java.lang.String,java.lang.Class<java.lang.Runnable>,java.lang.reflect.Method,java.lang.Object[])

/home/geronimo/geronimo/trunk/plugins/openejb/geronimo-openejb-clustering-wadi/src/test/java/org/apache/geronimo/openejb/cluster/stateful/container/ClusteredStatefulContainerTest.java:[179,25]
cannot find symbol
symbol  : method superBusinessMethod(org.apache.openejb.core.CoreDeploymentInfo,java.lang.String,java.lang.Class<java.lang.Runnable>,java.lang.reflect.Method,java.lang.Object[])
location: class org.apache.geronimo.openejb.cluster.stateful.container.ClusteredStatefulContainer

/home/geronimo/geronimo/trunk/plugins/openejb/geronimo-openejb-clustering-wadi/src/test/java/org/apache/geronimo/openejb/cluster/stateful/container/ClusteredStatefulContainerTest.java:[188,32]
removeEJBObject(org.apache.openejb.core.CoreDeploymentInfo,java.lang.Object,java.lang.Class,java.lang.reflect.Method,java.lang.Object[],org.apache.openejb.InterfaceType)
in org.apache.openejb.core.stateful.StatefulContainer cannot be applied to (org.apache.openejb.core.CoreDeploymentInfo,java.lang.String,java.lang.Class<java.lang.Runnable>,java.lang.reflect.Method,java.lang.Object[])

/home/geronimo/geronimo/trunk/plugins/openejb/geronimo-openejb-clustering-wadi/src/test/java/org/apache/geronimo/openejb/cluster/stateful/container/ClusteredStatefulContainerTest.java:[192,25]
cannot find symbol
symbol  : method superRemoveEJBObject(org.apache.openejb.core.CoreDeploymentInfo,java.lang.String,java.lang.Class<java.lang.Runnable>,java.lang.reflect.Method,java.lang.Object[])
location: class org.apache.geronimo.openejb.cluster.stateful.container.ClusteredStatefulContainer


[INFO] ------------------------------------------------------------------------
[INFO] Trace
org.apache.maven.BuildFailureException: Compilation failure
	at org.apache.maven.lifecycle.DefaultLifecycleExecutor.executeGoals(DefaultLifecycleExecutor.java:579)
	at org.apache.maven.lifecycle.DefaultLifecycleExecutor.executeGoalWithLifecycle(DefaultLifecycleExecutor.java:499)
	at org.apache.maven.lifecycle.DefaultLifecycleExecutor.executeGoal(DefaultLifecycleExecutor.java:478)
	at org.apache.maven.lifecycle.DefaultLifecycleExecutor.executeGoalAndHandleFailures(DefaultLifecycleExecutor.java:330)
	at org.apache.maven.lifecycle.DefaultLifecycleExecutor.executeTaskSegments(DefaultLifecycleExecutor.java:291)
	at org.apache.maven.lifecycle.DefaultLifecycleExecutor.execute(DefaultLifecycleExecutor.java:142)
	at org.apache.maven.DefaultMaven.doExecute(DefaultMaven.java:336)
	at org.apache.maven.DefaultMaven.execute(DefaultMaven.java:129)
	at org.apache.maven.cli.MavenCli.main(MavenCli.java:287)
	at sun.reflect.NativeMethodAccessorImpl.invoke0(Native Method)
	at sun.reflect.NativeMethodAccessorImpl.invoke(NativeMethodAccessorImpl.java:39)
	at sun.reflect.DelegatingMethodAccessorImpl.invoke(DelegatingMethodAccessorImpl.java:25)
	at java.lang.reflect.Method.invoke(Method.java:585)
	at org.codehaus.classworlds.Launcher.launchEnhanced(Launcher.java:315)
	at org.codehaus.classworlds.Launcher.launch(Launcher.java:255)
	at org.codehaus.classworlds.Launcher.mainWithExitCode(Launcher.java:430)
	at org.codehaus.classworlds.Launcher.main(Launcher.java:375)
Caused by: org.apache.maven.plugin.CompilationFailureException: Compilation failure
	at org.apache.maven.plugin.AbstractCompilerMojo.execute(AbstractCompilerMojo.java:516)
	at org.apache.maven.plugin.TestCompilerMojo.execute(TestCompilerMojo.java:102)
	at org.apache.maven.plugin.DefaultPluginManager.executeMojo(DefaultPluginManager.java:451)
	at org.apache.maven.lifecycle.DefaultLifecycleExecutor.executeGoals(DefaultLifecycleExecutor.java:558)
	... 16 more
[INFO] ------------------------------------------------------------------------
[INFO] Total time: 24 minutes 50 seconds
[INFO] Finished at: Thu Apr 23 09:28:05 EDT 2009
[INFO] Final Memory: 356M/984M
[INFO] ------------------------------------------------------------------------

Mime
View raw message