geronimo-dev mailing list archives

Site index · List index
Message view « Date » · « Thread »
Top « Date » · « Thread »
From David Jencks <david_jen...@yahoo.com>
Subject Re: [BUILD] trunk: Failed for Revision: 749297
Date Mon, 02 Mar 2009 16:41:31 GMT
I fixed some definite problems in security-testsuite but am still  
seeing some failures I don't understand locally.... lets see what  
happens next.

david jencks

On Mar 2, 2009, at 7:06 AM, gawor@apache.org wrote:

> Geronimo Revision: 749297 built with tests included
>
> See the full build-0900.log file at http://people.apache.org/builds/geronimo/server/binaries/trunk/20090302/build-0900.log
>
> Download the binaries from http://people.apache.org/builds/geronimo/server/binaries/trunk/20090302
> [INFO] BUILD SUCCESSFUL
> [INFO]  
> ------------------------------------------------------------------------
> [INFO] Total time: 38 minutes 15 seconds
> [INFO] Finished at: Mon Mar 02 09:43:41 EST 2009
> [INFO] Final Memory: 396M/1008M
> [INFO]  
> ------------------------------------------------------------------------
>
> TESTSUITE RESULTS (Failures only)
> =================================
> See detailed results at http://people.apache.org/builds/geronimo/server/testsuite/ResultsSummary.html
>
> Assembly: tomcat
> =================================
> See the full test.log file at http://people.apache.org/builds/geronimo/server/binaries/trunk/20090302/logs-0900-tomcat/test.log
>
>
> [INFO] snapshot org.apache.geronimo.assemblies:geronimo-tomcat6- 
> javaee5:2.2-SNAPSHOT: checking for updates from codehaus-snapshots
> [INFO] Using assembly artifact:  
> org.apache.geronimo.assemblies:geronimo-tomcat6-javaee5:zip:bin:2.2- 
> SNAPSHOT:provided
> [INFO] Using geronimoHome: /home/geronimo/geronimo/trunk/testsuite/ 
> target/geronimo-tomcat6-javaee5-2.2-SNAPSHOT
> [INFO] Installing assembly...
> [INFO] Expanding: /home/geronimo/.m2/repository/org/apache/geronimo/ 
> assemblies/geronimo-tomcat6-javaee5/2.2-SNAPSHOT/geronimo-tomcat6- 
> javaee5-2.2-SNAPSHOT-bin.zip into /home/geronimo/geronimo/trunk/ 
> testsuite/target
> [INFO] Starting Geronimo server...
> [INFO] Selected option set: default
> [INFO] Redirecting output to: /home/geronimo/geronimo/trunk/ 
> testsuite/target/geronimo-logs/ 
> org.apache.geronimo.mavenplugins.geronimo.server.StartServerMojo.log
> [INFO] Waiting for Geronimo server...
> [INFO] Geronimo server started in 0:00:44.953
> [INFO] [shitty:install {execution: default}]
> [INFO] Installing /home/geronimo/geronimo/trunk/testsuite/pom.xml  
> to /home/geronimo/.m2/repository/org/apache/geronimo/testsuite/ 
> testsuite/2.2-SNAPSHOT/testsuite-2.2-SNAPSHOT.pom
> [INFO] [shitty:test {execution: default}]
> [INFO] Starting 36 test builds
> [INFO]
> [INFO]  
> -------------------------------------------------------------------------------
> [INFO]
> [INFO] commands-testsuite/deploy                  RUNNING
> [INFO] commands-testsuite/deploy                  SUCCESS  
> (0:01:15.743)
> [INFO] commands-testsuite/gshell                  RUNNING
> [INFO] commands-testsuite/gshell                  SUCCESS  
> (0:00:29.947)
> [INFO] commands-testsuite/jaxws                   RUNNING
> [INFO] commands-testsuite/jaxws                   SUCCESS  
> (0:00:36.564)
> [INFO] commands-testsuite/shutdown                RUNNING
> [INFO] commands-testsuite/shutdown                SUCCESS  
> (0:00:17.080)
> [INFO] concurrent-testsuite/concurrent-basic      RUNNING
> [INFO] concurrent-testsuite/concurrent-basic      SUCCESS  
> (0:06:12.000)
> [INFO] console-testsuite/advanced                 RUNNING
> [INFO] console-testsuite/advanced                 SUCCESS  
> (0:01:23.446)
> [INFO] console-testsuite/basic                    RUNNING
> [INFO] console-testsuite/basic                    SUCCESS  
> (0:01:45.810)
> [INFO] corba-testsuite/corba-helloworld           RUNNING
> [INFO] corba-testsuite/corba-helloworld           SUCCESS  
> (0:00:46.125)
> [INFO] corba-testsuite/corba-marshal              RUNNING
> [INFO] corba-testsuite/corba-marshal              SUCCESS  
> (0:01:03.036)
> [INFO] corba-testsuite/corba-mytime               RUNNING
> [INFO] corba-testsuite/corba-mytime               SUCCESS  
> (0:00:39.585)
> [INFO] deployment-testsuite/deployment-tests      RUNNING
> [INFO] deployment-testsuite/deployment-tests      SUCCESS  
> (0:00:30.308)
> [INFO] deployment-testsuite/jca-cms-tests         RUNNING
> [INFO] deployment-testsuite/jca-cms-tests         SUCCESS  
> (0:00:29.991)
> [INFO] deployment-testsuite/manifestcp-tests      RUNNING
> [INFO] deployment-testsuite/manifestcp-tests      SUCCESS  
> (0:00:33.533)
> [INFO] enterprise-testsuite/ejb-tests             RUNNING
> [INFO] enterprise-testsuite/ejb-tests             SUCCESS  
> (0:01:28.091)
> [INFO] enterprise-testsuite/jms-tests             RUNNING
> [INFO] enterprise-testsuite/jms-tests             SUCCESS  
> (0:00:50.520)
> [INFO] enterprise-testsuite/jpa-tests             RUNNING
> [INFO] enterprise-testsuite/jpa-tests             SUCCESS  
> (0:01:05.940)
> [INFO] enterprise-testsuite/sec-client            RUNNING
> [INFO] enterprise-testsuite/sec-client            SUCCESS  
> (0:00:26.566)
> [INFO] enterprise-testsuite/sec-tests             RUNNING
> [INFO] enterprise-testsuite/sec-tests             SUCCESS  
> (0:00:47.489)
> [INFO] security-testsuite/test-security           RUNNING
> [INFO] security-testsuite/test-security           FAILURE  
> (0:00:37.496) Java returned: 1
> [INFO] web-testsuite/test-2.1-jsps                RUNNING
> [INFO] web-testsuite/test-2.1-jsps                SUCCESS  
> (0:00:28.734)
> [INFO] web-testsuite/test-2.5-servlets            RUNNING
> [INFO] web-testsuite/test-2.5-servlets            SUCCESS  
> (0:00:27.663)
> [INFO] web-testsuite/test-myfaces                 RUNNING
> [INFO] web-testsuite/test-myfaces                 SUCCESS  
> (0:00:29.292)
> [INFO] web-testsuite/test-tomcat                  RUNNING
> [INFO] web-testsuite/test-tomcat                  SUCCESS  
> (0:00:19.881)
> [INFO] web-testsuite/test-web-forward             RUNNING
> [INFO] web-testsuite/test-web-forward             SUCCESS  
> (0:00:33.323)
> [INFO] web-testsuite/test-web-references          RUNNING
> [INFO] web-testsuite/test-web-references          SUCCESS  
> (0:00:39.095)
> [INFO] webservices-testsuite/jaxb-tests           RUNNING
> [INFO] webservices-testsuite/jaxb-tests           SUCCESS  
> (0:00:49.623)
> [INFO] webservices-testsuite/jaxr-tests           RUNNING
> [INFO] webservices-testsuite/jaxr-tests           SUCCESS  
> (0:00:48.273)
> [INFO] webservices-testsuite/jaxrpc-jaxws-tests   RUNNING
> [INFO] webservices-testsuite/jaxrpc-jaxws-tests   SUCCESS  
> (0:00:31.577)
> [INFO] webservices-testsuite/jaxrpc-tests         RUNNING
> [INFO] webservices-testsuite/jaxrpc-tests         SUCCESS  
> (0:00:38.472)
> [INFO] webservices-testsuite/jaxws-catalog-tests  RUNNING
> [INFO] webservices-testsuite/jaxws-catalog-tests  SUCCESS  
> (0:00:38.062)
> [INFO] webservices-testsuite/jaxws-mtom-tests     RUNNING
> [INFO] webservices-testsuite/jaxws-mtom-tests     SUCCESS  
> (0:00:45.682)
> [INFO] webservices-testsuite/jaxws-provider-tests RUNNING
> [INFO] webservices-testsuite/jaxws-provider-tests SUCCESS  
> (0:00:41.264)
> [INFO] webservices-testsuite/jaxws-tests          RUNNING
> [INFO] webservices-testsuite/jaxws-tests          SUCCESS  
> (0:01:44.808)
> [INFO] webservices-testsuite/jaxws-wsa-tests      RUNNING
> [INFO] webservices-testsuite/jaxws-wsa-tests      SUCCESS  
> (0:00:46.945)
> [INFO] webservices-testsuite/saaj-tests           RUNNING
> [INFO] webservices-testsuite/saaj-tests           SUCCESS  
> (0:00:35.029)
> [INFO] webservices-testsuite/stax-tests           RUNNING
> [INFO] webservices-testsuite/stax-tests           SUCCESS  
> (0:00:51.288)
> [INFO]
> [INFO]  
> -------------------------------------------------------------------------------
> [INFO] Test Summary (0:33:08.491)
> [INFO]     Passed: 35
> [INFO]     Failed: 1
> [INFO]  
> -------------------------------------------------------------------------------
> [INFO]
> [INFO] The following tests failed:
> [INFO]     * security-testsuite/test-security - /home/geronimo/ 
> geronimo/trunk/testsuite/security-testsuite/test-security/build.log
> [INFO]
> [INFO]  
> ------------------------------------------------------------------------
> [ERROR] BUILD ERROR
>
> Assembly: jetty
> =================================
> See the full test.log file at http://people.apache.org/builds/geronimo/server/binaries/trunk/20090302/logs-0900-jetty/test.log
>
>
> [INFO] Using geronimoHome: /home/geronimo/geronimo/trunk/testsuite/ 
> target/geronimo-jetty6-javaee5-2.2-SNAPSHOT
> [INFO] Installing assembly...
> [INFO] Expanding: /home/geronimo/.m2/repository/org/apache/geronimo/ 
> assemblies/geronimo-jetty6-javaee5/2.2-SNAPSHOT/geronimo-jetty6- 
> javaee5-2.2-SNAPSHOT-bin.zip into /home/geronimo/geronimo/trunk/ 
> testsuite/target
> [INFO] Starting Geronimo server...
> [INFO] Selected option set: default
> [INFO] Redirecting output to: /home/geronimo/geronimo/trunk/ 
> testsuite/target/geronimo-logs/ 
> org.apache.geronimo.mavenplugins.geronimo.server.StartServerMojo.log
> [INFO] Waiting for Geronimo server...
> [INFO] Geronimo server started in 0:00:45.695
> [INFO] [shitty:install {execution: default}]
> [INFO] Installing /home/geronimo/geronimo/trunk/testsuite/pom.xml  
> to /home/geronimo/.m2/repository/org/apache/geronimo/testsuite/ 
> testsuite/2.2-SNAPSHOT/testsuite-2.2-SNAPSHOT.pom
> [INFO] [shitty:test {execution: default}]
> [INFO] Starting 36 test builds
> [INFO]
> [INFO]  
> -------------------------------------------------------------------------------
> [INFO]
> [INFO] commands-testsuite/deploy                  RUNNING
> [INFO] commands-testsuite/deploy                  SUCCESS  
> (0:01:11.121)
> [INFO] commands-testsuite/gshell                  RUNNING
> [INFO] commands-testsuite/gshell                  SUCCESS  
> (0:00:31.192)
> [INFO] commands-testsuite/jaxws                   RUNNING
> [INFO] commands-testsuite/jaxws                   SUCCESS  
> (0:00:34.248)
> [INFO] commands-testsuite/shutdown                RUNNING
> [INFO] commands-testsuite/shutdown                SUCCESS  
> (0:00:16.906)
> [INFO] concurrent-testsuite/concurrent-basic      RUNNING
> [INFO] concurrent-testsuite/concurrent-basic      SUCCESS  
> (0:06:05.253)
> [INFO] console-testsuite/advanced                 RUNNING
> [INFO] console-testsuite/advanced                 FAILURE  
> (0:00:17.375) Java returned: 1
> [INFO] console-testsuite/basic                    RUNNING
> [INFO] console-testsuite/basic                    FAILURE  
> (0:00:17.451) Java returned: 1
> [INFO] corba-testsuite/corba-helloworld           RUNNING
> [INFO] corba-testsuite/corba-helloworld           SUCCESS  
> (0:00:47.816)
> [INFO] corba-testsuite/corba-marshal              RUNNING
> [INFO] corba-testsuite/corba-marshal              SUCCESS  
> (0:01:10.906)
> [INFO] corba-testsuite/corba-mytime               RUNNING
> [INFO] corba-testsuite/corba-mytime               SUCCESS  
> (0:00:40.047)
> [INFO] deployment-testsuite/deployment-tests      RUNNING
> [INFO] deployment-testsuite/deployment-tests      SUCCESS  
> (0:00:29.927)
> [INFO] deployment-testsuite/jca-cms-tests         RUNNING
> [INFO] deployment-testsuite/jca-cms-tests         SUCCESS  
> (0:00:30.486)
> [INFO] deployment-testsuite/manifestcp-tests      RUNNING
> [INFO] deployment-testsuite/manifestcp-tests      SUCCESS  
> (0:00:32.057)
> [INFO] enterprise-testsuite/ejb-tests             RUNNING
> [INFO] enterprise-testsuite/ejb-tests             SUCCESS  
> (0:00:36.636)
> [INFO] enterprise-testsuite/jms-tests             RUNNING
> [INFO] enterprise-testsuite/jms-tests             SUCCESS  
> (0:00:51.196)
> [INFO] enterprise-testsuite/jpa-tests             RUNNING
> [INFO] enterprise-testsuite/jpa-tests             SUCCESS  
> (0:00:41.153)
> [INFO] enterprise-testsuite/sec-client            RUNNING
> [INFO] enterprise-testsuite/sec-client            SUCCESS  
> (0:00:27.303)
> [INFO] enterprise-testsuite/sec-tests             RUNNING
> [INFO] enterprise-testsuite/sec-tests             SUCCESS  
> (0:00:48.866)
> [INFO] security-testsuite/test-security           RUNNING
> [INFO] security-testsuite/test-security           FAILURE  
> (0:00:33.836) Java returned: 1
> [INFO] web-testsuite/test-2.1-jsps                RUNNING
> [INFO] web-testsuite/test-2.1-jsps                SUCCESS  
> (0:00:29.416)
> [INFO] web-testsuite/test-2.5-servlets            RUNNING
> [INFO] web-testsuite/test-2.5-servlets            SUCCESS  
> (0:00:28.308)
> [INFO] web-testsuite/test-jetty                   RUNNING
> [INFO] web-testsuite/test-jetty                   SUCCESS  
> (0:00:20.407)
> [INFO] web-testsuite/test-myfaces                 RUNNING
> [INFO] web-testsuite/test-myfaces                 SUCCESS  
> (0:00:31.142)
> [INFO] web-testsuite/test-web-forward             RUNNING
> [INFO] web-testsuite/test-web-forward             SUCCESS  
> (0:00:33.439)
> [INFO] web-testsuite/test-web-references          RUNNING
> [INFO] web-testsuite/test-web-references          SUCCESS  
> (0:00:38.373)
> [INFO] webservices-testsuite/jaxb-tests           RUNNING
> [INFO] webservices-testsuite/jaxb-tests           SUCCESS  
> (0:00:52.007)
> [INFO] webservices-testsuite/jaxr-tests           RUNNING
> [INFO] webservices-testsuite/jaxr-tests           SUCCESS  
> (0:00:51.077)
> [INFO] webservices-testsuite/jaxrpc-jaxws-tests   RUNNING
> [INFO] webservices-testsuite/jaxrpc-jaxws-tests   SUCCESS  
> (0:00:27.335)
> [INFO] webservices-testsuite/jaxrpc-tests         RUNNING
> [INFO] webservices-testsuite/jaxrpc-tests         SUCCESS  
> (0:00:40.401)
> [INFO] webservices-testsuite/jaxws-catalog-tests  RUNNING
> [INFO] webservices-testsuite/jaxws-catalog-tests  SUCCESS  
> (0:00:40.147)
> [INFO] webservices-testsuite/jaxws-mtom-tests     RUNNING
> [INFO] webservices-testsuite/jaxws-mtom-tests     SUCCESS  
> (0:00:39.220)
> [INFO] webservices-testsuite/jaxws-provider-tests RUNNING
> [INFO] webservices-testsuite/jaxws-provider-tests SUCCESS  
> (0:00:47.787)
> [INFO] webservices-testsuite/jaxws-tests          RUNNING
> [INFO] webservices-testsuite/jaxws-tests          SUCCESS  
> (0:01:30.607)
> [INFO] webservices-testsuite/jaxws-wsa-tests      RUNNING
> [INFO] webservices-testsuite/jaxws-wsa-tests      SUCCESS  
> (0:00:40.917)
> [INFO] webservices-testsuite/saaj-tests           RUNNING
> [INFO] webservices-testsuite/saaj-tests           SUCCESS  
> (0:00:35.948)
> [INFO] webservices-testsuite/stax-tests           RUNNING
> [INFO] webservices-testsuite/stax-tests           SUCCESS  
> (0:00:51.297)
> [INFO]
> [INFO]  
> -------------------------------------------------------------------------------
> [INFO] Test Summary (0:29:01.859)
> [INFO]     Passed: 33
> [INFO]     Failed: 3
> [INFO]  
> -------------------------------------------------------------------------------
> [INFO]
> [INFO] The following tests failed:
> [INFO]     * console-testsuite/advanced - /home/geronimo/geronimo/ 
> trunk/testsuite/console-testsuite/advanced/build.log
> [INFO]     * console-testsuite/basic - /home/geronimo/geronimo/trunk/ 
> testsuite/console-testsuite/basic/build.log
> [INFO]     * security-testsuite/test-security - /home/geronimo/ 
> geronimo/trunk/testsuite/security-testsuite/test-security/build.log
> [INFO]
> [INFO]  
> ------------------------------------------------------------------------
> [ERROR] BUILD ERROR
>
> Samples: trunk
> =================================
> Log: http://people.apache.org/builds/geronimo/server/binaries/trunk/20090302/samples-0900.log
>
> Build status: FAILED
>


Mime
View raw message