geronimo-dev mailing list archives

Site index · List index
Message view « Date » · « Thread »
Top « Date » · « Thread »
From ga...@apache.org
Subject [BUILD] trunk: Failed for Revision: 751989
Date Tue, 10 Mar 2009 06:35:40 GMT
Geronimo Revision: 751989 built with tests included
 
See the full build-0300.log file at http://people.apache.org/builds/geronimo/server/binaries/trunk/20090310/build-0300.log
 
 
See the unit test reports at http://people.apache.org/builds/geronimo/server/binaries/trunk/20090310/unit-test-reports
 
139K downloaded
Downloading: http://people.apache.org/repo/m2-incubating-repository//org/apache/neethi/neethi/2.0.4/neethi-2.0.4.jar
Downloading: http://repo.exist.com/maven2/org/apache/neethi/neethi/2.0.4/neethi-2.0.4.jar
32K downloaded
Downloading: http://people.apache.org/repo/m2-incubating-repository//org/apache/woden/woden-api/1.0M8/woden-api-1.0M8.jar
Downloading: http://ws.zones.apache.org/repository2/org/apache/woden/woden-api/1.0M8/woden-api-1.0M8.jar
Downloading: http://tomcat.apache.org/dev/dist/m2-repository/org/apache/woden/woden-api/1.0M8/woden-api-1.0M8.jar
Downloading: http://repo1.maven.org/eclipse/org/apache/woden/woden-api/1.0M8/woden-api-1.0M8.jar
Downloading: https://maven-repository.dev.java.net/nonav/repository//org.apache.woden/jars/woden-api-1.0M8.jar
Downloading: http://repo.exist.com/maven2/org/apache/woden/woden-api/1.0M8/woden-api-1.0M8.jar
145K downloaded
Downloading: http://people.apache.org/repo/m2-snapshot-repository/org/apache/woden/woden-impl-dom/1.0-SNAPSHOT/woden-impl-dom-1.0-SNAPSHOT.jar
220K downloaded
Downloading: http://people.apache.org/repo/m2-snapshot-repository/org/apache/axis2/axis2-saaj/1.5-SNAPSHOT/axis2-saaj-1.5-SNAPSHOT.jar
86K downloaded
Downloading: http://people.apache.org/repo/m2-snapshot-repository/org/apache/axis2/axis2-metadata/1.5-SNAPSHOT/axis2-metadata-1.5-SNAPSHOT.jar
383K downloaded
Downloading: http://people.apache.org/repo/m2-snapshot-repository/org/apache/axis2/axis2-transport-http/SNAPSHOT/axis2-transport-http-SNAPSHOT.jar
149K downloaded
Downloading: http://people.apache.org/repo/m2-incubating-repository//org/apache/httpcomponents/httpcore/4.0-beta1/httpcore-4.0-beta1.jar
Downloading: http://repo.exist.com/maven2/org/apache/httpcomponents/httpcore/4.0-beta1/httpcore-4.0-beta1.jar
164K downloaded
Downloading: http://people.apache.org/repo/m2-snapshot-repository/org/apache/axis2/axis2-transport-base/SNAPSHOT/axis2-transport-base-SNAPSHOT.jar
74K downloaded
[INFO] [enforcer:enforce {execution: default}]
[INFO] [remote-resources:process {execution: process}]
[INFO] [remote-resources:process {execution: default}]
[INFO] [resources:resources]
[INFO] Using 'UTF-8' encoding to copy filtered resources.
[INFO] Copying 1 resource
[INFO] Copying 3 resources
[INFO] Copying 3 resources
[INFO] [compiler:compile]
[INFO] Compiling 20 source files to /home/geronimo/geronimo/trunk/plugins/axis2/geronimo-axis2/target/classes
[INFO] [resources:testResources]
[INFO] Using 'UTF-8' encoding to copy filtered resources.
[INFO] Copying 6 resources
[INFO] Copying 3 resources
[INFO] Copying 3 resources
[INFO] [compiler:testCompile]
[INFO] Compiling 7 source files to /home/geronimo/geronimo/trunk/plugins/axis2/geronimo-axis2/target/test-classes
[INFO] [surefire:test]
[WARNING] Component returned which is not the same manager. Ignored. component=org.apache.maven.profiles.activation.AlwaysOnProfileActivator@736a736a
[WARNING] Component returned which is not the same manager. Ignored. component=org.apache.maven.profiles.activation.FileProfileActivator@736a736a
[INFO] Surefire report directory: /home/geronimo/geronimo/trunk/plugins/axis2/geronimo-axis2/target/surefire-reports

-------------------------------------------------------
 T E S T S
-------------------------------------------------------
Running org.apache.geronimo.axis2.Axis2WebServiceContainerTest
Tests run: 3, Failures: 0, Errors: 2, Skipped: 0, Time elapsed: 0.696 sec <<< FAILURE!

Results :

Tests in error: 
  testRPCInvokeWithWSDL(org.apache.geronimo.axis2.Axis2WebServiceContainerTest)
  testGetWSDL(org.apache.geronimo.axis2.Axis2WebServiceContainerTest)

Tests run: 3, Failures: 0, Errors: 2, Skipped: 0

[INFO] ------------------------------------------------------------------------
[ERROR] BUILD FAILURE
[INFO] ------------------------------------------------------------------------
[INFO] There are test failures.

Please refer to /home/geronimo/geronimo/trunk/plugins/axis2/geronimo-axis2/target/surefire-reports
for the individual test results.
[INFO] ------------------------------------------------------------------------
[INFO] Trace
org.apache.maven.BuildFailureException: There are test failures.

Please refer to /home/geronimo/geronimo/trunk/plugins/axis2/geronimo-axis2/target/surefire-reports
for the individual test results.
	at org.apache.maven.lifecycle.DefaultLifecycleExecutor.executeGoals(DefaultLifecycleExecutor.java:579)
	at org.apache.maven.lifecycle.DefaultLifecycleExecutor.executeGoalWithLifecycle(DefaultLifecycleExecutor.java:499)
	at org.apache.maven.lifecycle.DefaultLifecycleExecutor.executeGoal(DefaultLifecycleExecutor.java:478)
	at org.apache.maven.lifecycle.DefaultLifecycleExecutor.executeGoalAndHandleFailures(DefaultLifecycleExecutor.java:330)
	at org.apache.maven.lifecycle.DefaultLifecycleExecutor.executeTaskSegments(DefaultLifecycleExecutor.java:291)
	at org.apache.maven.lifecycle.DefaultLifecycleExecutor.execute(DefaultLifecycleExecutor.java:142)
	at org.apache.maven.DefaultMaven.doExecute(DefaultMaven.java:336)
	at org.apache.maven.DefaultMaven.execute(DefaultMaven.java:129)
	at org.apache.maven.cli.MavenCli.main(MavenCli.java:287)
	at sun.reflect.NativeMethodAccessorImpl.invoke0(Native Method)
	at sun.reflect.NativeMethodAccessorImpl.invoke(NativeMethodAccessorImpl.java:79)
	at sun.reflect.DelegatingMethodAccessorImpl.invoke(DelegatingMethodAccessorImpl.java:43)
	at java.lang.reflect.Method.invoke(Method.java:618)
	at org.codehaus.classworlds.Launcher.launchEnhanced(Launcher.java:315)
	at org.codehaus.classworlds.Launcher.launch(Launcher.java:255)
	at org.codehaus.classworlds.Launcher.mainWithExitCode(Launcher.java:430)
	at org.codehaus.classworlds.Launcher.main(Launcher.java:375)
Caused by: org.apache.maven.plugin.MojoFailureException: There are test failures.

Please refer to /home/geronimo/geronimo/trunk/plugins/axis2/geronimo-axis2/target/surefire-reports
for the individual test results.
	at org.apache.maven.plugin.surefire.SurefirePlugin.execute(SurefirePlugin.java:530)
	at org.apache.maven.plugin.DefaultPluginManager.executeMojo(DefaultPluginManager.java:451)
	at org.apache.maven.lifecycle.DefaultLifecycleExecutor.executeGoals(DefaultLifecycleExecutor.java:558)
	... 16 more
[INFO] ------------------------------------------------------------------------
[INFO] Total time: 19 minutes 45 seconds
[INFO] Finished at: Tue Mar 10 03:23:57 EDT 2009
[INFO] Final Memory: 286M/671M
[INFO] ------------------------------------------------------------------------

Mime
View raw message