geronimo-dev mailing list archives

Site index · List index
Message view « Date » · « Thread »
Top « Date » · « Thread »
From David Jencks <david_jen...@yahoo.com>
Subject Re: [BUILD] trunk: Failed for Revision: 746081
Date Fri, 20 Feb 2009 02:13:46 GMT
I fixed the dependency change in rev 746111 and opened GERONIMO-4546  
since I don't know if we would rather exclude this dependency....  
hopefully jarek or someone will know.

thanks
david jencks

On Feb 19, 2009, at 5:33 PM, gawor@apache.org wrote:

> Geronimo Revision: 746081 built with tests included
>
> See the full build-2100.log file at http://people.apache.org/builds/geronimo/server/binaries/trunk/20090219/build-2100.log
>
>
> See the unit test reports at http://people.apache.org/builds/geronimo/server/binaries/trunk/20090219/unit-test-reports
>
> [INFO] [resources:resources]
> [INFO] Using 'UTF-8' encoding to copy filtered resources.
> [INFO] Copying 1 resource
> [INFO] Copying 3 resources
> [INFO] Copying 3 resources
> [INFO] [compiler:compile]
> [INFO] Compiling 20 source files to /home/geronimo/geronimo/trunk/ 
> plugins/axis2/geronimo-axis2/target/classes
> [INFO] [resources:testResources]
> [INFO] Using 'UTF-8' encoding to copy filtered resources.
> [INFO] Copying 6 resources
> [INFO] Copying 3 resources
> [INFO] Copying 3 resources
> [INFO] [compiler:testCompile]
> [INFO] Compiling 7 source files to /home/geronimo/geronimo/trunk/ 
> plugins/axis2/geronimo-axis2/target/test-classes
> [INFO] [surefire:test]
> [INFO] Surefire report directory: /home/geronimo/geronimo/trunk/ 
> plugins/axis2/geronimo-axis2/target/surefire-reports
>
> -------------------------------------------------------
> T E S T S
> -------------------------------------------------------
> Running org.apache.geronimo.axis2.Axis2WebServiceContainerTest
> Tests run: 3, Failures: 0, Errors: 0, Skipped: 0, Time elapsed:  
> 2.884 sec
>
> Results :
>
> Tests run: 3, Failures: 0, Errors: 0, Skipped: 0
>
> [INFO] [jar:jar]
> [INFO] Building jar: /home/geronimo/geronimo/trunk/plugins/axis2/ 
> geronimo-axis2/target/geronimo-axis2-2.2-SNAPSHOT.jar
> [INFO] [ianal:verify-legal-files {execution: default}]
> [INFO] Checking legal files in: geronimo-axis2-2.2-SNAPSHOT.jar
> [INFO] [install:install]
> [INFO] Installing /home/geronimo/geronimo/trunk/plugins/axis2/ 
> geronimo-axis2/target/geronimo-axis2-2.2-SNAPSHOT.jar to /home/ 
> geronimo/.m2/repository/org/apache/geronimo/modules/geronimo- 
> axis2/2.2-SNAPSHOT/geronimo-axis2-2.2-SNAPSHOT.jar
> [INFO]  
> ------------------------------------------------------------------------
> [INFO] Building Geronimo Plugins, AXIS2 :: AXIS2
> [INFO]    task-segment: [install]
> [INFO]  
> ------------------------------------------------------------------------
> [INFO] snapshot org.apache.axis2:addressing:SNAPSHOT: checking for  
> updates from apache.snapshots
> [INFO] snapshot org.apache.axis2:addressing:SNAPSHOT: checking for  
> updates from apache-snapshots
> [INFO] snapshot org.apache.axis2:addressing:SNAPSHOT: checking for  
> updates from codehaus-snapshots
> Downloading: http://people.apache.org/repo/m2-snapshot-repository/org/apache/axis2/addressing/SNAPSHOT/addressing-SNAPSHOT.pom
> 3K downloaded
> Downloading: http://people.apache.org/repo/m2-snapshot-repository/org/apache/axis2/addressing/SNAPSHOT/addressing-SNAPSHOT.mar
> 24K downloaded
> [INFO] [enforcer:enforce {execution: default}]
> [INFO] [remote-resources:process {execution: process}]
> [INFO] [remote-resources:process {execution: default}]
> [INFO] [resources:resources]
> [INFO] Using 'UTF-8' encoding to copy filtered resources.
> [INFO] skip non existing resourceDirectory /home/geronimo/geronimo/ 
> trunk/plugins/axis2/axis2/src/main/resources
> [INFO] Copying 3 resources
> [INFO] Copying 3 resources
> [INFO] [car:validate-configuration]
> [INFO] [car:prepare-plan]
> [INFO] Generated: /home/geronimo/geronimo/trunk/plugins/axis2/axis2/ 
> target/resources/META-INF/plan.xml
> [INFO] [car:verify-no-dependency-change]
> [INFO]  
> ------------------------------------------------------------------------
> [ERROR] BUILD FAILURE
> [INFO]  
> ------------------------------------------------------------------------
> [INFO] Dependencies have changed:
> 	Added dependencies are saved here: /home/geronimo/geronimo/trunk/ 
> plugins/axis2/axis2/src/main/history/dependencies.added.xml
> 	Tree listing is saved here: /home/geronimo/geronimo/trunk/plugins/ 
> axis2/axis2/src/main/history/treeListing.xml
> Delete /home/geronimo/geronimo/trunk/plugins/axis2/axis2/src/main/ 
> history/dependencies.xml if you are happy with the dependency changes.
> [INFO]  
> ------------------------------------------------------------------------
> [INFO] Trace
> org.apache.maven.BuildFailureException: Dependencies have changed:
> 	Added dependencies are saved here: /home/geronimo/geronimo/trunk/ 
> plugins/axis2/axis2/src/main/history/dependencies.added.xml
> 	Tree listing is saved here: /home/geronimo/geronimo/trunk/plugins/ 
> axis2/axis2/src/main/history/treeListing.xml
> Delete /home/geronimo/geronimo/trunk/plugins/axis2/axis2/src/main/ 
> history/dependencies.xml if you are happy with the dependency changes.
> 	at  
> org 
> .apache 
> .maven 
> .lifecycle 
> .DefaultLifecycleExecutor.executeGoals(DefaultLifecycleExecutor.java: 
> 579)
> 	at  
> org 
> .apache 
> .maven 
> .lifecycle 
> .DefaultLifecycleExecutor 
> .executeGoalWithLifecycle(DefaultLifecycleExecutor.java:499)
> 	at  
> org 
> .apache 
> .maven 
> .lifecycle 
> .DefaultLifecycleExecutor.executeGoal(DefaultLifecycleExecutor.java: 
> 478)
> 	at  
> org 
> .apache 
> .maven 
> .lifecycle 
> .DefaultLifecycleExecutor 
> .executeGoalAndHandleFailures(DefaultLifecycleExecutor.java:330)
> 	at  
> org 
> .apache 
> .maven 
> .lifecycle 
> .DefaultLifecycleExecutor 
> .executeTaskSegments(DefaultLifecycleExecutor.java:291)
> 	at  
> org 
> .apache 
> .maven 
> .lifecycle 
> .DefaultLifecycleExecutor.execute(DefaultLifecycleExecutor.java:142)
> 	at org.apache.maven.DefaultMaven.doExecute(DefaultMaven.java:336)
> 	at org.apache.maven.DefaultMaven.execute(DefaultMaven.java:129)
> 	at org.apache.maven.cli.MavenCli.main(MavenCli.java:287)
> 	at sun.reflect.NativeMethodAccessorImpl.invoke0(Native Method)
> 	at  
> sun 
> .reflect 
> .NativeMethodAccessorImpl.invoke(NativeMethodAccessorImpl.java:39)
> 	at  
> sun 
> .reflect 
> .DelegatingMethodAccessorImpl 
> .invoke(DelegatingMethodAccessorImpl.java:25)
> 	at java.lang.reflect.Method.invoke(Method.java:597)
> 	at org.codehaus.classworlds.Launcher.launchEnhanced(Launcher.java: 
> 315)
> 	at org.codehaus.classworlds.Launcher.launch(Launcher.java:255)
> 	at org.codehaus.classworlds.Launcher.mainWithExitCode(Launcher.java: 
> 430)
> 	at org.codehaus.classworlds.Launcher.main(Launcher.java:375)
> Caused by: org.apache.maven.plugin.MojoFailureException:  
> Dependencies have changed:
> 	Added dependencies are saved here: /home/geronimo/geronimo/trunk/ 
> plugins/axis2/axis2/src/main/history/dependencies.added.xml
> 	Tree listing is saved here: /home/geronimo/geronimo/trunk/plugins/ 
> axis2/axis2/src/main/history/treeListing.xml
> Delete /home/geronimo/geronimo/trunk/plugins/axis2/axis2/src/main/ 
> history/dependencies.xml if you are happy with the dependency changes.
> 	at  
> org 
> .apache 
> .geronimo 
> .mavenplugins 
> .car 
> .DependencyChangeMojo 
> .saveDependencyChanges(DependencyChangeMojo.java:154)
> 	at  
> org 
> .apache 
> .geronimo 
> .mavenplugins 
> .car.DependencyChangeMojo.execute(DependencyChangeMojo.java:113)
> 	at  
> org 
> .apache 
> .maven 
> .plugin.DefaultPluginManager.executeMojo(DefaultPluginManager.java: 
> 451)
> 	at  
> org 
> .apache 
> .maven 
> .lifecycle 
> .DefaultLifecycleExecutor.executeGoals(DefaultLifecycleExecutor.java: 
> 558)
> 	... 16 more
> [INFO]  
> ------------------------------------------------------------------------
> [INFO] Total time: 18 minutes 23 seconds
> [INFO] Finished at: Thu Feb 19 21:21:18 EST 2009
> [INFO] Final Memory: 512M/812M
> [INFO]  
> ------------------------------------------------------------------------


Mime
View raw message