geronimo-dev mailing list archives

Site index · List index
Message view « Date » · « Thread »
Top « Date » · « Thread »
From Donald Woods <dwo...@apache.org>
Subject Re: [BUILD] branches/2.1: Failed for Revision: 745486 - Changes in OpenEJB
Date Wed, 18 Feb 2009 18:38:51 GMT
I'm seeing EJB deployment failures due to OpenEJB 3.0.1-SNAPSHOT 
upgrading to ASM 3.1.

------------------------------------------------------------------------
r745463 | dblevins | 2009-02-18 05:10:40 -0500 (Wed, 18 Feb 2009) | 2 lines

ASM 2.2.3 to ASM 3.1 upgrade

------------------------------------------------------------------------



2009-02-18 13:10:49,970 ERROR [Deployer] Deployment failed due to
java.lang.NoSuchMethodError: 
org.objectweb.asm.ClassReader.accept(Lorg/objectweb/asm/ClassVisitor;I)V
         at 
org.apache.openejb.core.TempClassLoader.isAnnotationClass(TempClassLoader.java:132)
         at 
org.apache.openejb.core.TempClassLoader.loadClass(TempClassLoader.java:92)
         at 
org.apache.openejb.core.TempClassLoader.loadClass(TempClassLoader.java:50)
         at 
org.apache.openejb.assembler.classic.CmpJarBuilder.generateClass(CmpJarBuilder.java:117)
         at 
org.apache.openejb.assembler.classic.CmpJarBuilder.generate(CmpJarBuilder.java:71)
         at 
org.apache.openejb.assembler.classic.CmpJarBuilder.getJarFile(CmpJarBuilder.java:53)
         at 
org.apache.geronimo.openejb.deployment.EjbModuleBuilder.getEjbJarInfo(EjbModuleBuilder.java:604)
         at 
org.apache.geronimo.openejb.deployment.EjbModuleBuilder.initContext(EjbModuleBuilder.java:500)
         at 
org.apache.geronimo.j2ee.deployment.EARConfigBuilder.buildConfiguration(EARConfigBuilder.java:595)
         at 
org.apache.geronimo.deployment.Deployer.deploy(Deployer.java:255)
         at 
org.apache.geronimo.deployment.Deployer.deploy(Deployer.java:134)
...


-Donald


gawor@apache.org wrote:
> Geronimo Revision: 745486 built with tests included
>  
> See the full build-0800.log file at http://people.apache.org/builds/geronimo/server/binaries/2.1/20090218/build-0800.log
>  
> Download the binaries from http://people.apache.org/builds/geronimo/server/binaries/2.1/20090218
> [INFO] BUILD SUCCESSFUL
> [INFO] ------------------------------------------------------------------------
> [INFO] Total time: 33 minutes 59 seconds
> [INFO] Finished at: Wed Feb 18 08:40:50 EST 2009
> [INFO] Final Memory: 314M/932M
> [INFO] ------------------------------------------------------------------------
>  
> TESTSUITE RESULTS (Failures only)
> =================================
> See detailed results at http://people.apache.org/builds/geronimo/server/testsuite/ResultsSummary.html
>  
> Assembly: tomcat
> =================================
> See the full test.log file at http://people.apache.org/builds/geronimo/server/binaries/2.1/20090218/logs-0800-tomcat/test.log
>  
> [INFO] Running deployment-testsuite.deployment
> [INFO] Tests run: 2, Failures: 1, Errors: 0, Skipped: 0, Time elapsed: 0.398 sec <<<
FAILURE!
> --
> [INFO] Running org.apache.geronimo.testsuite.testset.EJBJAXRTest
> [INFO] Tests run: 1, Failures: 1, Errors: 0, Skipped: 0, Time elapsed: 0.213 sec <<<
FAILURE!
> --
> [INFO] Running org.apache.geronimo.testsuite.testset.EJBStaxTest
> [INFO] Tests run: 1, Failures: 1, Errors: 0, Skipped: 0, Time elapsed: 0.211 sec <<<
FAILURE!
> --
> [INFO] Running org.apache.geronimo.testsuite.testset.EJBJAXBTest
> [INFO] Tests run: 1, Failures: 1, Errors: 0, Skipped: 0, Time elapsed: 0.213 sec <<<
FAILURE!
> --
> [INFO] Running org.apache.geronimo.testsuite.testset.JaxRPCTest
> [INFO] Tests run: 3, Failures: 1, Errors: 0, Skipped: 0, Time elapsed: 0.434 sec <<<
FAILURE!
> [INFO] Running security-testsuite.security
> [INFO] Tests run: 36, Failures: 5, Errors: 0, Skipped: 0, Time elapsed: 11.525 sec <<<
FAILURE!
>  
> Assembly: jetty
> =================================
> See the full test.log file at http://people.apache.org/builds/geronimo/server/binaries/2.1/20090218/logs-0800-jetty/test.log
>  
> [INFO] Running deployment-testsuite.deployment
> [INFO] Tests run: 2, Failures: 1, Errors: 0, Skipped: 0, Time elapsed: 0.426 sec <<<
FAILURE!
> --
> [INFO] Running org.apache.geronimo.testsuite.testset.EJBJAXRTest
> [INFO] Tests run: 1, Failures: 1, Errors: 0, Skipped: 0, Time elapsed: 0.211 sec <<<
FAILURE!
> --
> [INFO] Running org.apache.geronimo.testsuite.testset.EJBStaxTest
> [INFO] Tests run: 1, Failures: 1, Errors: 0, Skipped: 0, Time elapsed: 0.213 sec <<<
FAILURE!
> --
> [INFO] Running org.apache.geronimo.testsuite.testset.EJBJAXBTest
> [INFO] Tests run: 1, Failures: 1, Errors: 0, Skipped: 0, Time elapsed: 0.215 sec <<<
FAILURE!
> --
> [INFO] Running org.apache.geronimo.testsuite.testset.JaxRPCTest
> [INFO] Tests run: 3, Failures: 1, Errors: 0, Skipped: 0, Time elapsed: 0.441 sec <<<
FAILURE!
> [INFO] Running security-testsuite.security
> [INFO] Tests run: 36, Failures: 5, Errors: 0, Skipped: 0, Time elapsed: 9.339 sec <<<
FAILURE!
>  
> Samples: branches/2.1
> =================================
> Log: http://people.apache.org/builds/geronimo/server/binaries/2.1/20090218/samples-0800.log
>  
> Build status: OK
>  
> 

Mime
View raw message