geronimo-dev mailing list archives

Site index · List index
Message view « Date » · « Thread »
Top « Date » · « Thread »
From ga...@apache.org
Subject [BUILD] branches/2.1: Failed for Revision: 747356
Date Tue, 24 Feb 2009 14:52:22 GMT
Geronimo Revision: 747356 built with tests included
 
See the full build-0800.log file at http://people.apache.org/builds/geronimo/server/binaries/2.1/20090224/build-0800.log
 
Download the binaries from http://people.apache.org/builds/geronimo/server/binaries/2.1/20090224
[INFO] BUILD SUCCESSFUL
[INFO] ------------------------------------------------------------------------
[INFO] Total time: 33 minutes 29 seconds
[INFO] Finished at: Tue Feb 24 08:39:34 EST 2009
[INFO] Final Memory: 315M/929M
[INFO] ------------------------------------------------------------------------
 
TESTSUITE RESULTS (Failures only)
=================================
See detailed results at http://people.apache.org/builds/geronimo/server/testsuite/ResultsSummary.html
 
Assembly: tomcat
=================================
See the full test.log file at http://people.apache.org/builds/geronimo/server/binaries/2.1/20090224/logs-0800-tomcat/test.log
 
[INFO] Running org.apache.geronimo.testsuite.testset.EJBJAXRTest
[INFO] Tests run: 1, Failures: 1, Errors: 0, Skipped: 0, Time elapsed: 0.211 sec <<<
FAILURE!
--
[INFO] Running org.apache.geronimo.testsuite.testset.EJBStaxTest
[INFO] Tests run: 1, Failures: 1, Errors: 0, Skipped: 0, Time elapsed: 0.223 sec <<<
FAILURE!
--
[INFO] Running org.apache.geronimo.testsuite.testset.EJBJAXBTest
[INFO] Tests run: 1, Failures: 1, Errors: 0, Skipped: 0, Time elapsed: 0.214 sec <<<
FAILURE!
--
[INFO] Running org.apache.geronimo.testsuite.testset.JaxRPCTest
[INFO] Tests run: 3, Failures: 1, Errors: 0, Skipped: 0, Time elapsed: 0.437 sec <<<
FAILURE!
[INFO] Running security-testsuite.security
[INFO] Tests run: 36, Failures: 5, Errors: 0, Skipped: 0, Time elapsed: 11.407 sec <<<
FAILURE!
 
Assembly: jetty
=================================
See the full test.log file at http://people.apache.org/builds/geronimo/server/binaries/2.1/20090224/logs-0800-jetty/test.log
 
[INFO] Running org.apache.geronimo.testsuite.testset.EJBJAXRTest
[INFO] Tests run: 1, Failures: 1, Errors: 0, Skipped: 0, Time elapsed: 0.223 sec <<<
FAILURE!
--
[INFO] Running org.apache.geronimo.testsuite.testset.EJBStaxTest
[INFO] Tests run: 1, Failures: 1, Errors: 0, Skipped: 0, Time elapsed: 0.214 sec <<<
FAILURE!
--
[INFO] Running org.apache.geronimo.testsuite.testset.EJBJAXBTest
[INFO] Tests run: 1, Failures: 1, Errors: 0, Skipped: 0, Time elapsed: 0.234 sec <<<
FAILURE!
--
[INFO] Running org.apache.geronimo.testsuite.testset.JaxRPCTest
[INFO] Tests run: 3, Failures: 1, Errors: 0, Skipped: 0, Time elapsed: 0.441 sec <<<
FAILURE!
[INFO] Running security-testsuite.security
[INFO] Tests run: 36, Failures: 5, Errors: 0, Skipped: 0, Time elapsed: 10.101 sec <<<
FAILURE!
 
Samples: branches/2.1
=================================
Log: http://people.apache.org/builds/geronimo/server/binaries/2.1/20090224/samples-0800.log
 
Build status: OK
 

Mime
View raw message