geronimo-dev mailing list archives

Site index · List index
Message view « Date » · « Thread »
Top « Date » · « Thread »
From ga...@apache.org
Subject [BUILD] branches/2.0: Failed for Revision: 746419
Date Sat, 21 Feb 2009 02:12:51 GMT
Geronimo Revision: 746419 built with tests included
 
See the full build-2000.log file at http://people.apache.org/builds/geronimo/server/binaries/2.0/20090220/build-2000.log
 
Download the binaries from http://people.apache.org/builds/geronimo/server/binaries/2.0/20090220
[INFO] BUILD SUCCESSFUL
[INFO] ------------------------------------------------------------------------
[INFO] Total time: 33 minutes 51 seconds
[INFO] Finished at: Fri Feb 20 20:38:31 EST 2009
[INFO] Final Memory: 219M/862M
[INFO] ------------------------------------------------------------------------
 
TESTSUITE RESULTS (Failures only)
=================================
See detailed results at http://people.apache.org/builds/geronimo/server/testsuite/ResultsSummary.html
 
Assembly: tomcat
=================================
See the full test.log file at http://people.apache.org/builds/geronimo/server/binaries/2.0/20090220/logs-2000-tomcat/test.log
 
[INFO] Running deployment-testsuite.deployment
[INFO] Tests run: 2, Failures: 1, Errors: 0, Skipped: 0, Time elapsed: 0.277 sec <<<
FAILURE!
--
[INFO] Running jpa-testsuite.jpa
[INFO] Tests run: 1, Failures: 1, Errors: 0, Skipped: 0, Time elapsed: 0.288 sec <<<
FAILURE!
[INFO] Running sec-testsuite.security
[INFO] Tests run: 2, Failures: 2, Errors: 0, Skipped: 0, Time elapsed: 0.623 sec <<<
FAILURE!
--
[INFO] Running web-testsuite.references
[INFO] Tests run: 1, Failures: 1, Errors: 0, Skipped: 0, Time elapsed: 0.267 sec <<<
FAILURE!
--
[INFO] Running org.apache.geronimo.testsuite.testset.EJBJAXRTest
[INFO] Tests run: 1, Failures: 1, Errors: 0, Skipped: 0, Time elapsed: 0.22 sec <<<
FAILURE!
--
[INFO] Running org.apache.geronimo.testsuite.testset.EJBStaxTest
[INFO] Tests run: 1, Failures: 1, Errors: 0, Skipped: 0, Time elapsed: 0.214 sec <<<
FAILURE!
--
[INFO] Running org.apache.geronimo.testsuite.testset.EJBJAXBTest
[INFO] Tests run: 1, Failures: 1, Errors: 0, Skipped: 0, Time elapsed: 0.209 sec <<<
FAILURE!
--
[INFO] Running org.apache.geronimo.testsuite.testset.JaxRPCTest
[INFO] Tests run: 3, Failures: 1, Errors: 0, Skipped: 0, Time elapsed: 0.463 sec <<<
FAILURE!
 
Assembly: jetty
=================================
See the full test.log file at http://people.apache.org/builds/geronimo/server/binaries/2.0/20090220/logs-2000-jetty/test.log
 
[INFO] Running deployment-testsuite.deployment
[INFO] Tests run: 2, Failures: 1, Errors: 0, Skipped: 0, Time elapsed: 0.333 sec <<<
FAILURE!
--
[INFO] Running jpa-testsuite.jpa
[INFO] Tests run: 1, Failures: 1, Errors: 0, Skipped: 0, Time elapsed: 0.316 sec <<<
FAILURE!
[INFO] Running sec-testsuite.security
[INFO] Tests run: 2, Failures: 2, Errors: 0, Skipped: 0, Time elapsed: 0.671 sec <<<
FAILURE!
--
[INFO] Running web-testsuite.references
[INFO] Tests run: 1, Failures: 1, Errors: 0, Skipped: 0, Time elapsed: 0.344 sec <<<
FAILURE!
--
[INFO] Running org.apache.geronimo.testsuite.testset.EJBJAXRTest
[INFO] Tests run: 1, Failures: 1, Errors: 0, Skipped: 0, Time elapsed: 0.206 sec <<<
FAILURE!
--
[INFO] Running org.apache.geronimo.testsuite.testset.EJBStaxTest
[INFO] Tests run: 1, Failures: 1, Errors: 0, Skipped: 0, Time elapsed: 0.208 sec <<<
FAILURE!
--
[INFO] Running org.apache.geronimo.testsuite.testset.EJBJAXBTest
[INFO] Tests run: 1, Failures: 1, Errors: 0, Skipped: 0, Time elapsed: 0.204 sec <<<
FAILURE!
--
[INFO] Running org.apache.geronimo.testsuite.testset.JaxRPCTest
[INFO] Tests run: 3, Failures: 1, Errors: 0, Skipped: 0, Time elapsed: 0.528 sec <<<
FAILURE!

Mime
View raw message