geronimo-dev mailing list archives

Site index · List index
Message view « Date » · « Thread »
Top « Date » · « Thread »
From ga...@apache.org
Subject [BUILD] branches/2.0: Failed for Revision: 745307
Date Wed, 18 Feb 2009 02:06:15 GMT
Geronimo Revision: 745307 built with tests included
 
See the full build-2000.log file at http://people.apache.org/builds/geronimo/server/binaries/2.0/20090217/build-2000.log
 
Download the binaries from http://people.apache.org/builds/geronimo/server/binaries/2.0/20090217
[INFO] BUILD SUCCESSFUL
[INFO] ------------------------------------------------------------------------
[INFO] Total time: 33 minutes 49 seconds
[INFO] Finished at: Tue Feb 17 20:36:13 EST 2009
[INFO] Final Memory: 216M/863M
[INFO] ------------------------------------------------------------------------
 
TESTSUITE RESULTS (Failures only)
=================================
See detailed results at http://people.apache.org/builds/geronimo/server/testsuite/ResultsSummary.html
 
Assembly: tomcat
=================================
See the full test.log file at http://people.apache.org/builds/geronimo/server/binaries/2.0/20090217/logs-2000-tomcat/test.log
 
[INFO] Running deployment-testsuite.deployment
[INFO] Tests run: 2, Failures: 1, Errors: 0, Skipped: 0, Time elapsed: 0.274 sec <<<
FAILURE!
--
[INFO] Running jpa-testsuite.jpa
[INFO] Tests run: 1, Failures: 1, Errors: 0, Skipped: 0, Time elapsed: 0.289 sec <<<
FAILURE!
[INFO] Running sec-testsuite.security
[INFO] Tests run: 2, Failures: 2, Errors: 0, Skipped: 0, Time elapsed: 0.616 sec <<<
FAILURE!
--
[INFO] Running web-testsuite.references
[INFO] Tests run: 1, Failures: 1, Errors: 0, Skipped: 0, Time elapsed: 0.282 sec <<<
FAILURE!
 
Assembly: jetty
=================================
See the full test.log file at http://people.apache.org/builds/geronimo/server/binaries/2.0/20090217/logs-2000-jetty/test.log
 
[INFO] Running deployment-testsuite.deployment
[INFO] Tests run: 2, Failures: 1, Errors: 0, Skipped: 0, Time elapsed: 0.35 sec <<<
FAILURE!
--
[INFO] Running jpa-testsuite.jpa
[INFO] Tests run: 1, Failures: 1, Errors: 0, Skipped: 0, Time elapsed: 0.297 sec <<<
FAILURE!
[INFO] Running sec-testsuite.security
[INFO] Tests run: 2, Failures: 2, Errors: 0, Skipped: 0, Time elapsed: 0.683 sec <<<
FAILURE!
--
[INFO] Running web-testsuite.references
[INFO] Tests run: 1, Failures: 1, Errors: 0, Skipped: 0, Time elapsed: 0.497 sec <<<
FAILURE!

Mime
View raw message