geronimo-dev mailing list archives

Site index · List index
Message view « Date » · « Thread »
Top « Date » · « Thread »
From ga...@apache.org
Subject [BUILD] trunk: Failed for Revision: 744587
Date Sun, 15 Feb 2009 03:06:59 GMT
Geronimo Revision: 744587 built with tests included
 
See the full build-2100.log file at http://people.apache.org/builds/geronimo/server/binaries/trunk/20090214/build-2100.log
 
Download the binaries from http://people.apache.org/builds/geronimo/server/binaries/trunk/20090214
[INFO] BUILD SUCCESSFUL
[INFO] ------------------------------------------------------------------------
[INFO] Total time: 35 minutes 4 seconds
[INFO] Finished at: Sat Feb 14 21:39:01 EST 2009
[INFO] Final Memory: 676M/938M
[INFO] ------------------------------------------------------------------------
 
TESTSUITE RESULTS (Failures only)
=================================
See detailed results at http://people.apache.org/builds/geronimo/server/testsuite/ResultsSummary.html
 
Assembly: tomcat
=================================
See the full test.log file at http://people.apache.org/builds/geronimo/server/binaries/trunk/20090214/logs-2100-tomcat/test.log
 
 
[INFO] snapshot org.apache.geronimo.assemblies:geronimo-tomcat6-javaee5:2.2-SNAPSHOT: checking
for updates from codehaus-snapshots
[INFO] Using assembly artifact: org.apache.geronimo.assemblies:geronimo-tomcat6-javaee5:zip:bin:2.2-SNAPSHOT:provided
[INFO] Using geronimoHome: /home/geronimo/geronimo/trunk/testsuite/target/geronimo-tomcat6-javaee5-2.2-SNAPSHOT
[INFO] Installing assembly...
[INFO] Expanding: /home/geronimo/.m2/repository/org/apache/geronimo/assemblies/geronimo-tomcat6-javaee5/2.2-SNAPSHOT/geronimo-tomcat6-javaee5-2.2-SNAPSHOT-bin.zip
into /home/geronimo/geronimo/trunk/testsuite/target
[INFO] Starting Geronimo server...
[INFO] Selected option set: default
[INFO] Redirecting output to: /home/geronimo/geronimo/trunk/testsuite/target/geronimo-logs/org.apache.geronimo.mavenplugins.geronimo.server.StartServerMojo.log
[INFO] Waiting for Geronimo server...
[INFO] Geronimo server started in 0:00:41.071
[INFO] [shitty:install {execution: default}]
[INFO] Installing /home/geronimo/geronimo/trunk/testsuite/pom.xml to /home/geronimo/.m2/repository/org/apache/geronimo/testsuite/testsuite/2.2-SNAPSHOT/testsuite-2.2-SNAPSHOT.pom
[INFO] [shitty:test {execution: default}]
[INFO] Starting 36 test builds
[INFO] 
[INFO] -------------------------------------------------------------------------------
[INFO] 
[INFO] commands-testsuite/deploy                  RUNNING
[INFO] commands-testsuite/deploy                  SUCCESS (0:00:59.918) 
[INFO] commands-testsuite/gshell                  RUNNING
[INFO] commands-testsuite/gshell                  SUCCESS (0:00:28.492) 
[INFO] commands-testsuite/jaxws                   RUNNING
[INFO] commands-testsuite/jaxws                   SUCCESS (0:00:33.178) 
[INFO] commands-testsuite/shutdown                RUNNING
[INFO] commands-testsuite/shutdown                SUCCESS (0:00:16.712) 
[INFO] concurrent-testsuite/concurrent-basic      RUNNING
[INFO] concurrent-testsuite/concurrent-basic      SUCCESS (0:06:22.638) 
[INFO] console-testsuite/advanced                 RUNNING
[INFO] console-testsuite/advanced                 SUCCESS (0:01:19.165) 
[INFO] console-testsuite/basic                    RUNNING
[INFO] console-testsuite/basic                    SUCCESS (0:01:42.680) 
[INFO] corba-testsuite/corba-helloworld           RUNNING
[INFO] corba-testsuite/corba-helloworld           SUCCESS (0:00:47.335) 
[INFO] corba-testsuite/corba-marshal              RUNNING
[INFO] corba-testsuite/corba-marshal              SUCCESS (0:00:45.155) 
[INFO] corba-testsuite/corba-mytime               RUNNING
[INFO] corba-testsuite/corba-mytime               SUCCESS (0:00:40.634) 
[INFO] deployment-testsuite/deployment-tests      RUNNING
[INFO] deployment-testsuite/deployment-tests      SUCCESS (0:00:31.133) 
[INFO] deployment-testsuite/jca-cms-tests         RUNNING
[INFO] deployment-testsuite/jca-cms-tests         SUCCESS (0:00:30.356) 
[INFO] deployment-testsuite/manifestcp-tests      RUNNING
[INFO] deployment-testsuite/manifestcp-tests      SUCCESS (0:00:31.335) 
[INFO] enterprise-testsuite/ejb-tests             RUNNING
[INFO] enterprise-testsuite/ejb-tests             SUCCESS (0:00:58.274) 
[INFO] enterprise-testsuite/jms-tests             RUNNING
[INFO] enterprise-testsuite/jms-tests             SUCCESS (0:00:51.687) 
[INFO] enterprise-testsuite/jpa-tests             RUNNING
[INFO] enterprise-testsuite/jpa-tests             SUCCESS (0:01:04.234) 
[INFO] enterprise-testsuite/sec-client            RUNNING
[INFO] enterprise-testsuite/sec-client            SUCCESS (0:00:27.576) 
[INFO] enterprise-testsuite/sec-tests             RUNNING
[INFO] enterprise-testsuite/sec-tests             SUCCESS (0:00:47.397) 
[INFO] security-testsuite/test-security           RUNNING
[INFO] security-testsuite/test-security           FAILURE (0:00:37.341) Java returned: 1
[INFO] web-testsuite/test-2.1-jsps                RUNNING
[INFO] web-testsuite/test-2.1-jsps                SUCCESS (0:00:29.536) 
[INFO] web-testsuite/test-2.5-servlets            RUNNING
[INFO] web-testsuite/test-2.5-servlets            SUCCESS (0:00:29.193) 
[INFO] web-testsuite/test-myfaces                 RUNNING
[INFO] web-testsuite/test-myfaces                 SUCCESS (0:00:31.447) 
[INFO] web-testsuite/test-tomcat                  RUNNING
[INFO] web-testsuite/test-tomcat                  SUCCESS (0:00:19.694) 
[INFO] web-testsuite/test-web-forward             RUNNING
[INFO] web-testsuite/test-web-forward             SUCCESS (0:00:33.388) 
[INFO] web-testsuite/test-web-references          RUNNING
[INFO] web-testsuite/test-web-references          SUCCESS (0:00:38.098) 
[INFO] webservices-testsuite/jaxb-tests           RUNNING
[INFO] webservices-testsuite/jaxb-tests           SUCCESS (0:00:53.899) 
[INFO] webservices-testsuite/jaxr-tests           RUNNING
[INFO] webservices-testsuite/jaxr-tests           SUCCESS (0:00:54.051) 
[INFO] webservices-testsuite/jaxrpc-jaxws-tests   RUNNING
[INFO] webservices-testsuite/jaxrpc-jaxws-tests   SUCCESS (0:00:32.792) 
[INFO] webservices-testsuite/jaxrpc-tests         RUNNING
[INFO] webservices-testsuite/jaxrpc-tests         SUCCESS (0:00:42.655) 
[INFO] webservices-testsuite/jaxws-catalog-tests  RUNNING
[INFO] webservices-testsuite/jaxws-catalog-tests  SUCCESS (0:00:39.633) 
[INFO] webservices-testsuite/jaxws-mtom-tests     RUNNING
[INFO] webservices-testsuite/jaxws-mtom-tests     SUCCESS (0:00:45.091) 
[INFO] webservices-testsuite/jaxws-provider-tests RUNNING
[INFO] webservices-testsuite/jaxws-provider-tests SUCCESS (0:00:41.510) 
[INFO] webservices-testsuite/jaxws-tests          RUNNING
[INFO] webservices-testsuite/jaxws-tests          SUCCESS (0:01:42.521) 
[INFO] webservices-testsuite/jaxws-wsa-tests      RUNNING
[INFO] webservices-testsuite/jaxws-wsa-tests      SUCCESS (0:00:46.688) 
[INFO] webservices-testsuite/saaj-tests           RUNNING
[INFO] webservices-testsuite/saaj-tests           SUCCESS (0:00:35.214) 
[INFO] webservices-testsuite/stax-tests           RUNNING
[INFO] webservices-testsuite/stax-tests           SUCCESS (0:00:51.994) 
[INFO] 
[INFO] -------------------------------------------------------------------------------
[INFO] Test Summary (0:32:22.862)
[INFO]     Passed: 35
[INFO]     Failed: 1
[INFO] -------------------------------------------------------------------------------
[INFO] 
[INFO] The following tests failed:
[INFO]     * security-testsuite/test-security - /home/geronimo/geronimo/trunk/testsuite/security-testsuite/test-security/build.log
[INFO] 
[INFO] ------------------------------------------------------------------------
[ERROR] BUILD ERROR
 
Assembly: jetty
=================================
See the full test.log file at http://people.apache.org/builds/geronimo/server/binaries/trunk/20090214/logs-2100-jetty/test.log
 
 
[INFO] snapshot org.apache.geronimo.assemblies:geronimo-jetty6-javaee5:2.2-SNAPSHOT: checking
for updates from codehaus-snapshots
[INFO] Using assembly artifact: org.apache.geronimo.assemblies:geronimo-jetty6-javaee5:zip:bin:2.2-SNAPSHOT:provided
[INFO] Using geronimoHome: /home/geronimo/geronimo/trunk/testsuite/target/geronimo-jetty6-javaee5-2.2-SNAPSHOT
[INFO] Installing assembly...
[INFO] Expanding: /home/geronimo/.m2/repository/org/apache/geronimo/assemblies/geronimo-jetty6-javaee5/2.2-SNAPSHOT/geronimo-jetty6-javaee5-2.2-SNAPSHOT-bin.zip
into /home/geronimo/geronimo/trunk/testsuite/target
[INFO] Starting Geronimo server...
[INFO] Selected option set: default
[INFO] Redirecting output to: /home/geronimo/geronimo/trunk/testsuite/target/geronimo-logs/org.apache.geronimo.mavenplugins.geronimo.server.StartServerMojo.log
[INFO] Waiting for Geronimo server...
[INFO] Geronimo server started in 0:00:42.928
[INFO] [shitty:install {execution: default}]
[INFO] Installing /home/geronimo/geronimo/trunk/testsuite/pom.xml to /home/geronimo/.m2/repository/org/apache/geronimo/testsuite/testsuite/2.2-SNAPSHOT/testsuite-2.2-SNAPSHOT.pom
[INFO] [shitty:test {execution: default}]
[INFO] Starting 36 test builds
[INFO] 
[INFO] -------------------------------------------------------------------------------
[INFO] 
[INFO] commands-testsuite/deploy                  RUNNING
[INFO] commands-testsuite/deploy                  SUCCESS (0:00:57.584) 
[INFO] commands-testsuite/gshell                  RUNNING
[INFO] commands-testsuite/gshell                  SUCCESS (0:00:28.682) 
[INFO] commands-testsuite/jaxws                   RUNNING
[INFO] commands-testsuite/jaxws                   SUCCESS (0:00:31.947) 
[INFO] commands-testsuite/shutdown                RUNNING
[INFO] commands-testsuite/shutdown                SUCCESS (0:00:16.465) 
[INFO] concurrent-testsuite/concurrent-basic      RUNNING
[INFO] concurrent-testsuite/concurrent-basic      SUCCESS (0:06:06.128) 
[INFO] console-testsuite/advanced                 RUNNING
[INFO] console-testsuite/advanced                 SUCCESS (0:01:19.320) 
[INFO] console-testsuite/basic                    RUNNING
[INFO] console-testsuite/basic                    SUCCESS (0:01:48.709) 
[INFO] corba-testsuite/corba-helloworld           RUNNING
[INFO] corba-testsuite/corba-helloworld           SUCCESS (0:00:44.546) 
[INFO] corba-testsuite/corba-marshal              RUNNING
[INFO] corba-testsuite/corba-marshal              SUCCESS (0:00:44.510) 
[INFO] corba-testsuite/corba-mytime               RUNNING
[INFO] corba-testsuite/corba-mytime               SUCCESS (0:00:41.157) 
[INFO] deployment-testsuite/deployment-tests      RUNNING
[INFO] deployment-testsuite/deployment-tests      SUCCESS (0:00:30.972) 
[INFO] deployment-testsuite/jca-cms-tests         RUNNING
[INFO] deployment-testsuite/jca-cms-tests         SUCCESS (0:00:30.023) 
[INFO] deployment-testsuite/manifestcp-tests      RUNNING
[INFO] deployment-testsuite/manifestcp-tests      SUCCESS (0:00:31.000) 
[INFO] enterprise-testsuite/ejb-tests             RUNNING
[INFO] enterprise-testsuite/ejb-tests             SUCCESS (0:00:36.539) 
[INFO] enterprise-testsuite/jms-tests             RUNNING
[INFO] enterprise-testsuite/jms-tests             SUCCESS (0:00:52.824) 
[INFO] enterprise-testsuite/jpa-tests             RUNNING
[INFO] enterprise-testsuite/jpa-tests             SUCCESS (0:00:42.867) 
[INFO] enterprise-testsuite/sec-client            RUNNING
[INFO] enterprise-testsuite/sec-client            SUCCESS (0:00:26.971) 
[INFO] enterprise-testsuite/sec-tests             RUNNING
[INFO] enterprise-testsuite/sec-tests             SUCCESS (0:00:47.132) 
[INFO] security-testsuite/test-security           RUNNING
[INFO] security-testsuite/test-security           FAILURE (0:00:37.312) Java returned: 1
[INFO] web-testsuite/test-2.1-jsps                RUNNING
[INFO] web-testsuite/test-2.1-jsps                SUCCESS (0:00:29.283) 
[INFO] web-testsuite/test-2.5-servlets            RUNNING
[INFO] web-testsuite/test-2.5-servlets            SUCCESS (0:00:28.674) 
[INFO] web-testsuite/test-jetty                   RUNNING
[INFO] web-testsuite/test-jetty                   SUCCESS (0:00:20.984) 
[INFO] web-testsuite/test-myfaces                 RUNNING
[INFO] web-testsuite/test-myfaces                 SUCCESS (0:00:30.787) 
[INFO] web-testsuite/test-web-forward             RUNNING
[INFO] web-testsuite/test-web-forward             SUCCESS (0:00:34.897) 
[INFO] web-testsuite/test-web-references          RUNNING
[INFO] web-testsuite/test-web-references          SUCCESS (0:00:38.665) 
[INFO] webservices-testsuite/jaxb-tests           RUNNING
[INFO] webservices-testsuite/jaxb-tests           SUCCESS (0:00:54.047) 
[INFO] webservices-testsuite/jaxr-tests           RUNNING
[INFO] webservices-testsuite/jaxr-tests           SUCCESS (0:00:53.246) 
[INFO] webservices-testsuite/jaxrpc-jaxws-tests   RUNNING
[INFO] webservices-testsuite/jaxrpc-jaxws-tests   SUCCESS (0:00:28.316) 
[INFO] webservices-testsuite/jaxrpc-tests         RUNNING
[INFO] webservices-testsuite/jaxrpc-tests         SUCCESS (0:00:42.664) 
[INFO] webservices-testsuite/jaxws-catalog-tests  RUNNING
[INFO] webservices-testsuite/jaxws-catalog-tests  SUCCESS (0:00:41.608) 
[INFO] webservices-testsuite/jaxws-mtom-tests     RUNNING
[INFO] webservices-testsuite/jaxws-mtom-tests     SUCCESS (0:00:39.651) 
[INFO] webservices-testsuite/jaxws-provider-tests RUNNING
[INFO] webservices-testsuite/jaxws-provider-tests SUCCESS (0:00:44.805) 
[INFO] webservices-testsuite/jaxws-tests          RUNNING
[INFO] webservices-testsuite/jaxws-tests          SUCCESS (0:01:29.308) 
[INFO] webservices-testsuite/jaxws-wsa-tests      RUNNING
[INFO] webservices-testsuite/jaxws-wsa-tests      SUCCESS (0:00:41.501) 
[INFO] webservices-testsuite/saaj-tests           RUNNING
[INFO] webservices-testsuite/saaj-tests           SUCCESS (0:00:37.311) 
[INFO] webservices-testsuite/stax-tests           RUNNING
[INFO] webservices-testsuite/stax-tests           SUCCESS (0:00:53.294) 
[INFO] 
[INFO] -------------------------------------------------------------------------------
[INFO] Test Summary (0:31:03.916)
[INFO]     Passed: 35
[INFO]     Failed: 1
[INFO] -------------------------------------------------------------------------------
[INFO] 
[INFO] The following tests failed:
[INFO]     * security-testsuite/test-security - /home/geronimo/geronimo/trunk/testsuite/security-testsuite/test-security/build.log
[INFO] 
[INFO] ------------------------------------------------------------------------
[ERROR] BUILD ERROR
 
Samples: trunk
=================================
Log: http://people.apache.org/builds/geronimo/server/binaries/trunk/20090214/samples-2100.log
 
Build status: OK
 

Mime
View raw message