geronimo-dev mailing list archives

Site index · List index
Message view « Date » · « Thread »
Top « Date » · « Thread »
From ga...@apache.org
Subject [BUILD] branches/2.0: Failed for Revision: 741983
Date Sun, 08 Feb 2009 02:09:00 GMT
Geronimo Revision: 741983 built with tests included
 
See the full build-2000.log file at http://people.apache.org/builds/geronimo/server/binaries/2.0/20090207/build-2000.log
 
Download the binaries from http://people.apache.org/builds/geronimo/server/binaries/2.0/20090207
[INFO] BUILD SUCCESSFUL
[INFO] ------------------------------------------------------------------------
[INFO] Total time: 33 minutes 33 seconds
[INFO] Finished at: Sat Feb 07 20:37:59 EST 2009
[INFO] Final Memory: 216M/859M
[INFO] ------------------------------------------------------------------------
 
TESTSUITE RESULTS (Failures only)
=================================
See detailed results at http://people.apache.org/builds/geronimo/server/testsuite/ResultsSummary.html
 
Assembly: tomcat
=================================
See the full test.log file at http://people.apache.org/builds/geronimo/server/binaries/2.0/20090207/logs-2000-tomcat/test.log
 
[INFO] Running deployment-testsuite.deployment
[INFO] Tests run: 2, Failures: 1, Errors: 0, Skipped: 0, Time elapsed: 0.296 sec <<<
FAILURE!
--
[INFO] Running jpa-testsuite.jpa
[INFO] Tests run: 1, Failures: 1, Errors: 0, Skipped: 0, Time elapsed: 0.279 sec <<<
FAILURE!
[INFO] Running sec-testsuite.security
[INFO] Tests run: 2, Failures: 2, Errors: 0, Skipped: 0, Time elapsed: 0.614 sec <<<
FAILURE!
--
[INFO] Running web-testsuite.references
[INFO] Tests run: 1, Failures: 1, Errors: 0, Skipped: 0, Time elapsed: 0.284 sec <<<
FAILURE!
 
Assembly: jetty
=================================
See the full test.log file at http://people.apache.org/builds/geronimo/server/binaries/2.0/20090207/logs-2000-jetty/test.log
 
[INFO] Running deployment-testsuite.deployment
[INFO] Tests run: 2, Failures: 1, Errors: 0, Skipped: 0, Time elapsed: 0.326 sec <<<
FAILURE!
--
[INFO] Running jpa-testsuite.jpa
[INFO] Tests run: 1, Failures: 1, Errors: 0, Skipped: 0, Time elapsed: 0.331 sec <<<
FAILURE!
[INFO] Running sec-testsuite.security
[INFO] Tests run: 2, Failures: 2, Errors: 0, Skipped: 0, Time elapsed: 0.672 sec <<<
FAILURE!
--
[INFO] Running web-testsuite.references
[INFO] Tests run: 1, Failures: 1, Errors: 0, Skipped: 0, Time elapsed: 0.314 sec <<<
FAILURE!

Mime
View raw message