geronimo-dev mailing list archives

Site index · List index
Message view « Date » · « Thread »
Top « Date » · « Thread »
From ga...@apache.org
Subject [BUILD] branches/2.0: Failed for Revision: 741794
Date Sat, 07 Feb 2009 02:11:57 GMT
Geronimo Revision: 741794 built with tests included
 
See the full build-2000.log file at http://people.apache.org/builds/geronimo/server/binaries/2.0/20090206/build-2000.log
 
Download the binaries from http://people.apache.org/builds/geronimo/server/binaries/2.0/20090206
[INFO] BUILD SUCCESSFUL
[INFO] ------------------------------------------------------------------------
[INFO] Total time: 34 minutes 58 seconds
[INFO] Finished at: Fri Feb 06 20:40:19 EST 2009
[INFO] Final Memory: 256M/564M
[INFO] ------------------------------------------------------------------------
 
TESTSUITE RESULTS (Failures only)
=================================
See detailed results at http://people.apache.org/builds/geronimo/server/testsuite/ResultsSummary.html
 
Assembly: tomcat
=================================
See the full test.log file at http://people.apache.org/builds/geronimo/server/binaries/2.0/20090206/logs-2000-tomcat/test.log
 
[INFO] Running deployment-testsuite.deployment
[INFO] Tests run: 2, Failures: 1, Errors: 0, Skipped: 0, Time elapsed: 0.291 sec <<<
FAILURE!
--
[INFO] Running jpa-testsuite.jpa
[INFO] Tests run: 1, Failures: 1, Errors: 0, Skipped: 0, Time elapsed: 0.279 sec <<<
FAILURE!
[INFO] Running sec-testsuite.security
[INFO] Tests run: 2, Failures: 2, Errors: 0, Skipped: 0, Time elapsed: 0.606 sec <<<
FAILURE!
--
[INFO] Running web-testsuite.references
[INFO] Tests run: 1, Failures: 1, Errors: 0, Skipped: 0, Time elapsed: 0.282 sec <<<
FAILURE!
 
Assembly: jetty
=================================
See the full test.log file at http://people.apache.org/builds/geronimo/server/binaries/2.0/20090206/logs-2000-jetty/test.log
 
[INFO] Running deployment-testsuite.deployment
[INFO] Tests run: 2, Failures: 1, Errors: 0, Skipped: 0, Time elapsed: 0.332 sec <<<
FAILURE!
--
[INFO] Running jpa-testsuite.jpa
[INFO] Tests run: 1, Failures: 1, Errors: 0, Skipped: 0, Time elapsed: 0.319 sec <<<
FAILURE!
[INFO] Running sec-testsuite.security
[INFO] Tests run: 2, Failures: 2, Errors: 0, Skipped: 0, Time elapsed: 0.687 sec <<<
FAILURE!
--
[INFO] Running web-testsuite.references
[INFO] Tests run: 1, Failures: 1, Errors: 0, Skipped: 0, Time elapsed: 0.317 sec <<<
FAILURE!

Mime
View raw message