geronimo-dev mailing list archives

Site index · List index
Message view « Date » · « Thread »
Top « Date » · « Thread »
From ga...@apache.org
Subject [BUILD] trunk: Failed for Revision: 741679
Date Fri, 06 Feb 2009 19:26:02 GMT
Geronimo Revision: 741679 built with tests included
 
See the full build-1500.log file at http://people.apache.org/builds/geronimo/server/binaries/trunk/20090206/build-1500.log
 
 
See the unit test reports at http://people.apache.org/builds/geronimo/server/binaries/trunk/20090206/unit-test-reports
 
-------------------------------------------------------
 T E S T S
-------------------------------------------------------
Running org.apache.geronimo.naming.deployment.EnvironmentEntryBuilderTest
Tests run: 1, Failures: 0, Errors: 0, Skipped: 0, Time elapsed: 0.768 sec
Running org.apache.geronimo.naming.deployment.annotation.ResourceAnnotationTest
Tests run: 0, Failures: 0, Errors: 0, Skipped: 0, Time elapsed: 0.015 sec
Running org.apache.geronimo.naming.deployment.annotation.AnnotationHelperTest
Tests run: 1, Failures: 0, Errors: 0, Skipped: 0, Time elapsed: 0.478 sec

Results :

Tests run: 2, Failures: 0, Errors: 0, Skipped: 0

[INFO] [jar:jar]
[INFO] Building jar: /home/geronimo/geronimo/trunk/plugins/j2ee/geronimo-naming-builder/target/geronimo-naming-builder-2.2-SNAPSHOT.jar
[INFO] [ianal:verify-legal-files {execution: default}]
[INFO] Checking legal files in: geronimo-naming-builder-2.2-SNAPSHOT.jar
[INFO] [install:install]
[INFO] Installing /home/geronimo/geronimo/trunk/plugins/j2ee/geronimo-naming-builder/target/geronimo-naming-builder-2.2-SNAPSHOT.jar
to /home/geronimo/.m2/repository/org/apache/geronimo/modules/geronimo-naming-builder/2.2-SNAPSHOT/geronimo-naming-builder-2.2-SNAPSHOT.jar
[INFO] ------------------------------------------------------------------------
[INFO] Building Geronimo Plugins, J2EE :: Security Builder
[INFO]    task-segment: [install]
[INFO] ------------------------------------------------------------------------
[WARNING] POM for 'xpp3:xpp3_min:pom:1.1.4c:compile' is invalid. It will be ignored for artifact
resolution. Reason: Parse error reading POM. Reason: expected START_TAG or END_TAG not TEXT
(position: TEXT seen ...e with exception of classes directly in package org.xmlpull.v1 )</...
@15:169)  for project xpp3:xpp3_min at /home/geronimo/.m2/repository/xpp3/xpp3_min/1.1.4c/xpp3_min-1.1.4c.pom
[WARNING] POM for 'xpp3:xpp3_min:pom:1.1.4c:compile' is invalid. It will be ignored for artifact
resolution. Reason: Parse error reading POM. Reason: expected START_TAG or END_TAG not TEXT
(position: TEXT seen ...e with exception of classes directly in package org.xmlpull.v1 )</...
@15:169)  for project xpp3:xpp3_min at /home/geronimo/.m2/repository/xpp3/xpp3_min/1.1.4c/xpp3_min-1.1.4c.pom
[WARNING] POM for 'xpp3:xpp3_min:pom:1.1.4c:compile' is invalid. It will be ignored for artifact
resolution. Reason: Parse error reading POM. Reason: expected START_TAG or END_TAG not TEXT
(position: TEXT seen ...e with exception of classes directly in package org.xmlpull.v1 )</...
@15:169)  for project xpp3:xpp3_min at /home/geronimo/.m2/repository/xpp3/xpp3_min/1.1.4c/xpp3_min-1.1.4c.pom
[WARNING] POM for 'xpp3:xpp3_min:pom:1.1.4c:compile' is invalid. It will be ignored for artifact
resolution. Reason: Parse error reading POM. Reason: expected START_TAG or END_TAG not TEXT
(position: TEXT seen ...e with exception of classes directly in package org.xmlpull.v1 )</...
@15:169)  for project xpp3:xpp3_min at /home/geronimo/.m2/repository/xpp3/xpp3_min/1.1.4c/xpp3_min-1.1.4c.pom
[INFO] [enforcer:enforce {execution: default}]
[WARNING] POM for 'xpp3:xpp3_min:pom:1.1.4c:compile' is invalid. It will be ignored for artifact
resolution. Reason: Parse error reading POM. Reason: expected START_TAG or END_TAG not TEXT
(position: TEXT seen ...e with exception of classes directly in package org.xmlpull.v1 )</...
@15:169)  for project xpp3:xpp3_min at /home/geronimo/.m2/repository/xpp3/xpp3_min/1.1.4c/xpp3_min-1.1.4c.pom
[WARNING] POM for 'xpp3:xpp3_min:pom:1.1.4c:compile' is invalid. It will be ignored for artifact
resolution. Reason: Parse error reading POM. Reason: expected START_TAG or END_TAG not TEXT
(position: TEXT seen ...e with exception of classes directly in package org.xmlpull.v1 )</...
@15:169)  for project xpp3:xpp3_min at /home/geronimo/.m2/repository/xpp3/xpp3_min/1.1.4c/xpp3_min-1.1.4c.pom
[WARNING] POM for 'xpp3:xpp3_min:pom:1.1.4c:compile' is invalid. It will be ignored for artifact
resolution. Reason: Parse error reading POM. Reason: expected START_TAG or END_TAG not TEXT
(position: TEXT seen ...e with exception of classes directly in package org.xmlpull.v1 )</...
@15:169)  for project xpp3:xpp3_min at /home/geronimo/.m2/repository/xpp3/xpp3_min/1.1.4c/xpp3_min-1.1.4c.pom
[WARNING] POM for 'xpp3:xpp3_min:pom:1.1.4c:compile' is invalid. It will be ignored for artifact
resolution. Reason: Parse error reading POM. Reason: expected START_TAG or END_TAG not TEXT
(position: TEXT seen ...e with exception of classes directly in package org.xmlpull.v1 )</...
@15:169)  for project xpp3:xpp3_min at /home/geronimo/.m2/repository/xpp3/xpp3_min/1.1.4c/xpp3_min-1.1.4c.pom
[INFO] [xmlbeans:xmlbeans {execution: default}]
Time to build schema type system: 0.286 seconds
BUILD FAILED
[INFO] ------------------------------------------------------------------------
[ERROR] BUILD ERROR
[INFO] ------------------------------------------------------------------------
[INFO] XmlBeans compile failed:
 xml ErrorLoading schema file /home/geronimo/geronimo/trunk/plugins/j2ee/geronimo-security-builder/src/main/xsd/geronimo-security-1.2.xsd
xml ErrorLoading schema file /home/geronimo/geronimo/trunk/plugins/j2ee/geronimo-security-builder/src/main/xsd/geronimo-subject-info-1.0.xsd
xml ErrorLoading schema file /home/geronimo/geronimo/trunk/plugins/j2ee/geronimo-security-builder/src/main/xsd/geronimo-login-config-2.0.xsd
xml ErrorLoading schema file /home/geronimo/geronimo/trunk/plugins/j2ee/geronimo-security-builder/src/main/xsd/geronimo-soter-1.0.xsd
xml ErrorLoading schema file /home/geronimo/geronimo/trunk/plugins/j2ee/geronimo-security-builder/src/main/xsd/geronimo-credential-store-1.0.xsd
xml ErrorLoading schema file /home/geronimo/geronimo/trunk/plugins/j2ee/geronimo-security-builder/src/main/xsd/geronimo-security-2.0.xsd
xml ErrorLoading config file /home/geronimo/geronimo/trunk/plugins/j2ee/geronimo-security-builder/src/main/xsdconfig/xmlconfig.xml
xml Error/home/geronimo/geronimo/trunk/plugins/j2ee/geronimo-security-builder/src/main/xsd/geronimo-soter-1.0.xsd:36:5:
error: java.io.FileNotFoundException: /home/geronimo/geronimo/trunk/plugins/j2ee/geronimo-security-builder/src/main/xsd/rbac-xml.xsd
(No such file or directory)
xml Error/home/geronimo/geronimo/trunk/plugins/j2ee/geronimo-security-builder/src/main/xsd/geronimo-soter-1.0.xsd:61:21:
error: src-resolve: type 'rbacType@http://soter.org/xml/ns/rbac-xml' not found.

[INFO] ------------------------------------------------------------------------
[INFO] Trace
org.apache.maven.lifecycle.LifecycleExecutionException: XmlBeans compile failed:
 xml ErrorLoading schema file /home/geronimo/geronimo/trunk/plugins/j2ee/geronimo-security-builder/src/main/xsd/geronimo-security-1.2.xsd
xml ErrorLoading schema file /home/geronimo/geronimo/trunk/plugins/j2ee/geronimo-security-builder/src/main/xsd/geronimo-subject-info-1.0.xsd
xml ErrorLoading schema file /home/geronimo/geronimo/trunk/plugins/j2ee/geronimo-security-builder/src/main/xsd/geronimo-login-config-2.0.xsd
xml ErrorLoading schema file /home/geronimo/geronimo/trunk/plugins/j2ee/geronimo-security-builder/src/main/xsd/geronimo-soter-1.0.xsd
xml ErrorLoading schema file /home/geronimo/geronimo/trunk/plugins/j2ee/geronimo-security-builder/src/main/xsd/geronimo-credential-store-1.0.xsd
xml ErrorLoading schema file /home/geronimo/geronimo/trunk/plugins/j2ee/geronimo-security-builder/src/main/xsd/geronimo-security-2.0.xsd
xml ErrorLoading config file /home/geronimo/geronimo/trunk/plugins/j2ee/geronimo-security-builder/src/main/xsdconfig/xmlconfig.xml
xml Error/home/geronimo/geronimo/trunk/plugins/j2ee/geronimo-security-builder/src/main/xsd/geronimo-soter-1.0.xsd:36:5:
error: java.io.FileNotFoundException: /home/geronimo/geronimo/trunk/plugins/j2ee/geronimo-security-builder/src/main/xsd/rbac-xml.xsd
(No such file or directory)
xml Error/home/geronimo/geronimo/trunk/plugins/j2ee/geronimo-security-builder/src/main/xsd/geronimo-soter-1.0.xsd:61:21:
error: src-resolve: type 'rbacType@http://soter.org/xml/ns/rbac-xml' not found.

	at org.apache.maven.lifecycle.DefaultLifecycleExecutor.executeGoals(DefaultLifecycleExecutor.java:583)
	at org.apache.maven.lifecycle.DefaultLifecycleExecutor.executeGoalWithLifecycle(DefaultLifecycleExecutor.java:499)
	at org.apache.maven.lifecycle.DefaultLifecycleExecutor.executeGoal(DefaultLifecycleExecutor.java:478)
	at org.apache.maven.lifecycle.DefaultLifecycleExecutor.executeGoalAndHandleFailures(DefaultLifecycleExecutor.java:330)
	at org.apache.maven.lifecycle.DefaultLifecycleExecutor.executeTaskSegments(DefaultLifecycleExecutor.java:291)
	at org.apache.maven.lifecycle.DefaultLifecycleExecutor.execute(DefaultLifecycleExecutor.java:142)
	at org.apache.maven.DefaultMaven.doExecute(DefaultMaven.java:336)
	at org.apache.maven.DefaultMaven.execute(DefaultMaven.java:129)
	at org.apache.maven.cli.MavenCli.main(MavenCli.java:287)
	at sun.reflect.NativeMethodAccessorImpl.invoke0(Native Method)
	at sun.reflect.NativeMethodAccessorImpl.invoke(NativeMethodAccessorImpl.java:39)
	at sun.reflect.DelegatingMethodAccessorImpl.invoke(DelegatingMethodAccessorImpl.java:25)
	at java.lang.reflect.Method.invoke(Method.java:585)
	at org.codehaus.classworlds.Launcher.launchEnhanced(Launcher.java:315)
	at org.codehaus.classworlds.Launcher.launch(Launcher.java:255)
	at org.codehaus.classworlds.Launcher.mainWithExitCode(Launcher.java:430)
	at org.codehaus.classworlds.Launcher.main(Launcher.java:375)
Caused by: org.codehaus.mojo.xmlbeans.XmlBeansException: XmlBeans compile failed:
 xml ErrorLoading schema file /home/geronimo/geronimo/trunk/plugins/j2ee/geronimo-security-builder/src/main/xsd/geronimo-security-1.2.xsd
xml ErrorLoading schema file /home/geronimo/geronimo/trunk/plugins/j2ee/geronimo-security-builder/src/main/xsd/geronimo-subject-info-1.0.xsd
xml ErrorLoading schema file /home/geronimo/geronimo/trunk/plugins/j2ee/geronimo-security-builder/src/main/xsd/geronimo-login-config-2.0.xsd
xml ErrorLoading schema file /home/geronimo/geronimo/trunk/plugins/j2ee/geronimo-security-builder/src/main/xsd/geronimo-soter-1.0.xsd
xml ErrorLoading schema file /home/geronimo/geronimo/trunk/plugins/j2ee/geronimo-security-builder/src/main/xsd/geronimo-credential-store-1.0.xsd
xml ErrorLoading schema file /home/geronimo/geronimo/trunk/plugins/j2ee/geronimo-security-builder/src/main/xsd/geronimo-security-2.0.xsd
xml ErrorLoading config file /home/geronimo/geronimo/trunk/plugins/j2ee/geronimo-security-builder/src/main/xsdconfig/xmlconfig.xml
xml Error/home/geronimo/geronimo/trunk/plugins/j2ee/geronimo-security-builder/src/main/xsd/geronimo-soter-1.0.xsd:36:5:
error: java.io.FileNotFoundException: /home/geronimo/geronimo/trunk/plugins/j2ee/geronimo-security-builder/src/main/xsd/rbac-xml.xsd
(No such file or directory)
xml Error/home/geronimo/geronimo/trunk/plugins/j2ee/geronimo-security-builder/src/main/xsd/geronimo-soter-1.0.xsd:61:21:
error: src-resolve: type 'rbacType@http://soter.org/xml/ns/rbac-xml' not found.

	at org.codehaus.mojo.xmlbeans.AbstractXmlBeansPlugin.execute(AbstractXmlBeansPlugin.java:307)
	at org.apache.maven.plugin.DefaultPluginManager.executeMojo(DefaultPluginManager.java:451)
	at org.apache.maven.lifecycle.DefaultLifecycleExecutor.executeGoals(DefaultLifecycleExecutor.java:558)
	... 16 more
[INFO] ------------------------------------------------------------------------
[INFO] Total time: 11 minutes 3 seconds
[INFO] Finished at: Fri Feb 06 15:16:31 EST 2009
[INFO] Final Memory: 255M/561M
[INFO] ------------------------------------------------------------------------

Mime
View raw message