geronimo-dev mailing list archives

Site index · List index
Message view « Date » · « Thread »
Top « Date » · « Thread »
From ga...@apache.org
Subject [BUILD] branches/2.0: Failed for Revision: 721979
Date Mon, 01 Dec 2008 08:40:56 GMT
Geronimo Revision: 721979 built with tests included
 
See the full build-0200.log file at http://people.apache.org/builds/geronimo/server/binaries/2.0/20081201/build-0200.log
 
 
See the unit test reports at http://people.apache.org/builds/geronimo/server/binaries/2.0/20081201/unit-test-reports
 
Downloading: http://download.java.net/maven/1//org.apache.openjpa/jars/openjpa-1.0.3.jar
Downloading: http://people.apache.org/repo/m2-incubating-repository//org/apache/openjpa/openjpa/1.0.3/openjpa-1.0.3.jar
Downloading: http://repo1.maven.org/maven2/org/apache/openjpa/openjpa/1.0.3/openjpa-1.0.3.jar
10744K downloaded
Downloading: http://download.java.net/maven/1//org.apache.openjpa/jars/openjpa-jdbc-1.0.3.jar
Downloading: http://people.apache.org/repo/m2-incubating-repository//org/apache/openjpa/openjpa-jdbc/1.0.3/openjpa-jdbc-1.0.3.jar
Downloading: http://repo1.maven.org/maven2/org/apache/openjpa/openjpa-jdbc/1.0.3/openjpa-jdbc-1.0.3.jar
1011K downloaded
Downloading: http://download.java.net/maven/1//org.apache.openjpa/jars/openjpa-kernel-5-1.0.3.jar
Downloading: http://people.apache.org/repo/m2-incubating-repository//org/apache/openjpa/openjpa-kernel-5/1.0.3/openjpa-kernel-5-1.0.3.jar
Downloading: http://repo1.maven.org/maven2/org/apache/openjpa/openjpa-kernel-5/1.0.3/openjpa-kernel-5-1.0.3.jar
28K downloaded
Downloading: http://download.java.net/maven/1//org.apache.openjpa/jars/openjpa-persistence-jdbc-1.0.3.jar
Downloading: http://people.apache.org/repo/m2-incubating-repository//org/apache/openjpa/openjpa-persistence-jdbc/1.0.3/openjpa-persistence-jdbc-1.0.3.jar
Downloading: http://repo1.maven.org/maven2/org/apache/openjpa/openjpa-persistence-jdbc/1.0.3/openjpa-persistence-jdbc-1.0.3.jar
108K downloaded
Downloading: http://download.java.net/maven/1//commons-pool/jars/commons-pool-1.3.jar
Downloading: http://people.apache.org/repo/m2-incubating-repository//commons-pool/commons-pool/1.3/commons-pool-1.3.jar
Downloading: http://repo1.maven.org/maven2/commons-pool/commons-pool/1.3/commons-pool-1.3.jar
60K downloaded
Downloading: http://download.java.net/maven/1//org.apache.openjpa/jars/openjpa-jdbc-5-1.0.3.jar
Downloading: http://people.apache.org/repo/m2-incubating-repository//org/apache/openjpa/openjpa-jdbc-5/1.0.3/openjpa-jdbc-5-1.0.3.jar
Downloading: http://repo1.maven.org/maven2/org/apache/openjpa/openjpa-jdbc-5/1.0.3/openjpa-jdbc-5-1.0.3.jar
17K downloaded
Downloading: http://download.java.net/maven/1//org.apache.openjpa/jars/openjpa-lib-5-1.0.3.jar
Downloading: http://people.apache.org/repo/m2-incubating-repository//org/apache/openjpa/openjpa-lib-5/1.0.3/openjpa-lib-5-1.0.3.jar
Downloading: http://repo1.maven.org/maven2/org/apache/openjpa/openjpa-lib-5/1.0.3/openjpa-lib-5-1.0.3.jar
15K downloaded
Downloading: http://download.java.net/maven/1//javax.xml.bind/jars/jaxb-api-2.0.jar
72K downloaded
Downloading: http://download.java.net/maven/1//org.apache.openjpa/jars/openjpa-lib-1.0.3.jar
Downloading: http://people.apache.org/repo/m2-incubating-repository//org/apache/openjpa/openjpa-lib/1.0.3/openjpa-lib-1.0.3.jar
Downloading: http://repo1.maven.org/maven2/org/apache/openjpa/openjpa-lib/1.0.3/openjpa-lib-1.0.3.jar
427K downloaded
[WARNING] *** CHECKSUM FAILED - Checksum failed on download: local = 'e773a6fc1ea6bfc6e3cc895cc39b7ee4aad7055f';
remote = '50802072c1ea2afae641a835e2c6c80b5de2fc18' - RETRYING
Downloading: http://repo1.maven.org/maven2/org/apache/openjpa/openjpa-lib/1.0.3/openjpa-lib-1.0.3.jar
427K downloaded
[WARNING] *** CHECKSUM FAILED - Checksum failed on download: local = '4d33536c652c2af16575c36aaf3bd1b159fb0b6d';
remote = '50802072c1ea2afae641a835e2c6c80b5de2fc18' - IGNORING
Downloading: http://download.java.net/maven/1//net.sourceforge.serp/jars/serp-1.11.0.jar
Downloading: http://people.apache.org/repo/m2-incubating-repository//net/sourceforge/serp/serp/1.11.0/serp-1.11.0.jar
Downloading: http://repo1.maven.org/maven2/net/sourceforge/serp/serp/1.11.0/serp-1.11.0.jar
185K downloaded
Downloading: http://download.java.net/maven/1//org.apache.openjpa/jars/openjpa-kernel-1.0.3.jar
Downloading: http://people.apache.org/repo/m2-incubating-repository//org/apache/openjpa/openjpa-kernel/1.0.3/openjpa-kernel-1.0.3.jar
Downloading: http://repo1.maven.org/maven2/org/apache/openjpa/openjpa-kernel/1.0.3/openjpa-kernel-1.0.3.jar
1103K downloaded
[WARNING] *** CHECKSUM FAILED - Checksum failed on download: local = 'dfe4e4eb68a395093743ecfc6621ced2cff43196';
remote = '83a77b5286c53a9efd8e20b020b5fca711cf2fd0' - RETRYING
Downloading: http://repo1.maven.org/maven2/org/apache/openjpa/openjpa-kernel/1.0.3/openjpa-kernel-1.0.3.jar
1103K downloaded
[WARNING] *** CHECKSUM FAILED - Checksum failed on download: local = '1e25f2b3d96dffc2fb5b7afbe5e14cd1cc68b3a7';
remote = '83a77b5286c53a9efd8e20b020b5fca711cf2fd0' - IGNORING
Downloading: http://download.java.net/maven/1//org.apache.openjpa/jars/openjpa-persistence-1.0.3.jar
Downloading: http://people.apache.org/repo/m2-incubating-repository//org/apache/openjpa/openjpa-persistence/1.0.3/openjpa-persistence-1.0.3.jar
Downloading: http://repo1.maven.org/maven2/org/apache/openjpa/openjpa-persistence/1.0.3/openjpa-persistence-1.0.3.jar
229K downloaded
[INFO] [compiler:testCompile]
[INFO] Compiling 4 source files to /home/geronimo/geronimo/2.0/modules/geronimo-persistence-jpa10/target/test-classes
[INFO] ------------------------------------------------------------------------
[ERROR] BUILD FAILURE
[INFO] ------------------------------------------------------------------------
[INFO] Compilation failure
error: error reading /home/geronimo/.m2/repository/org/apache/openjpa/openjpa-kernel/1.0.3/openjpa-kernel-1.0.3.jar;
error in opening zip file


error: error reading /home/geronimo/.m2/repository/org/apache/openjpa/openjpa-kernel/1.0.3/openjpa-kernel-1.0.3.jar;
error in opening zip file

[INFO] ------------------------------------------------------------------------
[INFO] Trace
org.apache.maven.BuildFailureException: Compilation failure
error: error reading /home/geronimo/.m2/repository/org/apache/openjpa/openjpa-kernel/1.0.3/openjpa-kernel-1.0.3.jar;
error in opening zip file

	at org.apache.maven.lifecycle.DefaultLifecycleExecutor.executeGoals(DefaultLifecycleExecutor.java:560)
	at org.apache.maven.lifecycle.DefaultLifecycleExecutor.executeGoalWithLifecycle(DefaultLifecycleExecutor.java:480)
	at org.apache.maven.lifecycle.DefaultLifecycleExecutor.executeGoal(DefaultLifecycleExecutor.java:459)
	at org.apache.maven.lifecycle.DefaultLifecycleExecutor.executeGoalAndHandleFailures(DefaultLifecycleExecutor.java:311)
	at org.apache.maven.lifecycle.DefaultLifecycleExecutor.executeTaskSegments(DefaultLifecycleExecutor.java:278)
	at org.apache.maven.lifecycle.DefaultLifecycleExecutor.execute(DefaultLifecycleExecutor.java:143)
	at org.apache.maven.DefaultMaven.doExecute(DefaultMaven.java:334)
	at org.apache.maven.DefaultMaven.execute(DefaultMaven.java:125)
	at org.apache.maven.cli.MavenCli.main(MavenCli.java:280)
	at sun.reflect.NativeMethodAccessorImpl.invoke0(Native Method)
	at sun.reflect.NativeMethodAccessorImpl.invoke(NativeMethodAccessorImpl.java:39)
	at sun.reflect.DelegatingMethodAccessorImpl.invoke(DelegatingMethodAccessorImpl.java:25)
	at java.lang.reflect.Method.invoke(Method.java:585)
	at org.codehaus.classworlds.Launcher.launchEnhanced(Launcher.java:315)
	at org.codehaus.classworlds.Launcher.launch(Launcher.java:255)
	at org.codehaus.classworlds.Launcher.mainWithExitCode(Launcher.java:430)
	at org.codehaus.classworlds.Launcher.main(Launcher.java:375)
Caused by: org.apache.maven.plugin.CompilationFailureException: Compilation failure
error: error reading /home/geronimo/.m2/repository/org/apache/openjpa/openjpa-kernel/1.0.3/openjpa-kernel-1.0.3.jar;
error in opening zip file

	at org.apache.maven.plugin.AbstractCompilerMojo.execute(AbstractCompilerMojo.java:516)
	at org.apache.maven.plugin.TestCompilerMojo.execute(TestCompilerMojo.java:102)
	at org.apache.maven.plugin.DefaultPluginManager.executeMojo(DefaultPluginManager.java:443)
	at org.apache.maven.lifecycle.DefaultLifecycleExecutor.executeGoals(DefaultLifecycleExecutor.java:539)
	... 16 more
[INFO] ------------------------------------------------------------------------
[INFO] Total time: 138 minutes 17 seconds
[INFO] Finished at: Mon Dec 01 04:22:34 EST 2008
[INFO] Final Memory: 99M/542M
[INFO] ------------------------------------------------------------------------

Mime
View raw message