geronimo-dev mailing list archives

Site index · List index
Message view « Date » · « Thread »
Top « Date » · « Thread »
From ga...@apache.org
Subject [BUILD] trunk: Failed for Revision: 721750
Date Sun, 30 Nov 2008 09:18:29 GMT
Geronimo Revision: 721750 built with tests included
 
See the full build-2100.log file at http://people.apache.org/builds/geronimo/server/binaries/trunk/20081130/build-2100.log
 
Download the binaries from http://people.apache.org/builds/geronimo/server/binaries/trunk/20081130
[INFO] BUILD SUCCESSFUL
[INFO] ------------------------------------------------------------------------
[INFO] Total time: 305 minutes 32 seconds
[INFO] Finished at: Sun Nov 30 02:09:39 EST 2008
[INFO] Final Memory: 417M/669M
[INFO] ------------------------------------------------------------------------
 
TESTSUITE RESULTS (Failures only)
=================================
See detailed results at http://people.apache.org/builds/geronimo/server/testsuite/ResultsSummary.html
 
Assembly: tomcat
=================================
See the full test.log file at http://people.apache.org/builds/geronimo/server/binaries/trunk/20081130/logs-2100-tomcat/test.log
 
 
[INFO] snapshot org.apache.geronimo.framework:geronimo-common:2.2-SNAPSHOT: checking for updates
from apache.snapshots
[INFO] snapshot org.apache.geronimo.framework:geronimo-crypto:2.2-SNAPSHOT: checking for updates
from apache.snapshots
[INFO] snapshot org.apache.geronimo.framework:geronimo-plugin:2.2-SNAPSHOT: checking for updates
from apache.snapshots
[INFO] snapshot org.apache.geronimo.framework:geronimo-deploy-config:2.2-SNAPSHOT: checking
for updates from apache.snapshots
[INFO] [geronimo:start-server {execution: start}]
[INFO] Using assembly configuration: tomcat
[INFO] snapshot org.apache.geronimo.assemblies:geronimo-tomcat6-javaee5:2.2-SNAPSHOT: checking
for updates from apache.snapshots
[INFO] Using assembly artifact: org.apache.geronimo.assemblies:geronimo-tomcat6-javaee5:zip:bin:2.2-SNAPSHOT:provided
[INFO] Using geronimoHome: /home/geronimo/geronimo/trunk/testsuite/target/geronimo-tomcat6-javaee5-2.2-SNAPSHOT
[INFO] Installing assembly...
[INFO] Expanding: /home/geronimo/.m2/repository/org/apache/geronimo/assemblies/geronimo-tomcat6-javaee5/2.2-SNAPSHOT/geronimo-tomcat6-javaee5-2.2-SNAPSHOT-bin.zip
into /home/geronimo/geronimo/trunk/testsuite/target
[INFO] Starting Geronimo server...
[INFO] Selected option set: default
[INFO] Redirecting output to: /home/geronimo/geronimo/trunk/testsuite/target/geronimo-logs/org.apache.geronimo.mavenplugins.geronimo.server.StartServerMojo.log
[INFO] Waiting for Geronimo server...
[INFO] Geronimo server started in 0:00:42.774
[INFO] [shitty:install {execution: default}]
[INFO] Installing /home/geronimo/geronimo/trunk/testsuite/pom.xml to /home/geronimo/.m2/repository/org/apache/geronimo/testsuite/testsuite/2.2-SNAPSHOT/testsuite-2.2-SNAPSHOT.pom
[INFO] [shitty:test {execution: default}]
[INFO] Starting 33 test build(s)
[INFO] 
[INFO] -------------------------------------------------------------------------------
[INFO] 
[INFO] commands-testsuite/deploy                RUNNING
[INFO] commands-testsuite/deploy                SUCCESS (0:00:57.147) 
[INFO] commands-testsuite/gshell                RUNNING
[INFO] commands-testsuite/gshell                SUCCESS (0:00:27.399) 
[INFO] commands-testsuite/jaxws                 RUNNING
[INFO] commands-testsuite/jaxws                 SUCCESS (0:00:33.295) 
[INFO] commands-testsuite/shutdown              RUNNING
[INFO] commands-testsuite/shutdown              SUCCESS (0:00:15.932) 
[INFO] concurrent-testsuite/concurrent-basic    RUNNING
[INFO] concurrent-testsuite/concurrent-basic    SUCCESS (0:06:29.049) 
[INFO] console-testsuite/advanced               RUNNING
[INFO] console-testsuite/advanced               SUCCESS (0:01:35.805) 
[INFO] console-testsuite/basic                  RUNNING
[INFO] console-testsuite/basic                  SUCCESS (0:01:41.602) 
[INFO] corba-testsuite/corba-helloworld         RUNNING
[INFO] corba-testsuite/corba-helloworld         SUCCESS (0:00:46.636) 
[INFO] corba-testsuite/corba-marshal            RUNNING
[INFO] corba-testsuite/corba-marshal            SUCCESS (0:00:55.854) 
[INFO] corba-testsuite/corba-mytime             RUNNING
[INFO] corba-testsuite/corba-mytime             SUCCESS (0:00:44.420) 
[INFO] deployment-testsuite/deployment-tests    RUNNING
[INFO] deployment-testsuite/deployment-tests    SUCCESS (0:00:29.304) 
[INFO] deployment-testsuite/jca-cms-tests       RUNNING
[INFO] deployment-testsuite/jca-cms-tests       SUCCESS (0:00:28.596) 
[INFO] deployment-testsuite/manifestcp-tests    RUNNING
[INFO] deployment-testsuite/manifestcp-tests    SUCCESS (0:00:31.923) 
[INFO] enterprise-testsuite/ejb-tests           RUNNING
[INFO] enterprise-testsuite/ejb-tests           SUCCESS (0:00:46.323) 
[INFO] enterprise-testsuite/jms-tests           RUNNING
[INFO] enterprise-testsuite/jms-tests           SUCCESS (0:00:48.826) 
[INFO] enterprise-testsuite/jpa-tests           RUNNING
[INFO] enterprise-testsuite/jpa-tests           SUCCESS (0:12:06.235) 
[INFO] enterprise-testsuite/sec-client          RUNNING
[INFO] enterprise-testsuite/sec-client          SUCCESS (0:00:25.809) 
[INFO] enterprise-testsuite/sec-tests           RUNNING
[INFO] enterprise-testsuite/sec-tests           SUCCESS (0:00:50.850) 
[INFO] security-testsuite/test-security         RUNNING
[INFO] security-testsuite/test-security         FAILURE (0:00:33.594) Java returned: 1
[INFO] web-testsuite/test-2.1-jsps              RUNNING
[INFO] web-testsuite/test-2.1-jsps              SUCCESS (0:00:33.678) 
[INFO] web-testsuite/test-2.5-servlets          RUNNING
[INFO] web-testsuite/test-2.5-servlets          SUCCESS (0:00:26.409) 
[INFO] web-testsuite/test-myfaces               RUNNING
[INFO] web-testsuite/test-myfaces               SUCCESS (0:00:31.465) 
[INFO] web-testsuite/test-tomcat                RUNNING
[INFO] web-testsuite/test-tomcat                SUCCESS (0:00:19.223) 
[INFO] web-testsuite/test-web-forward           RUNNING
[INFO] web-testsuite/test-web-forward           SUCCESS (0:00:33.049) 
[INFO] web-testsuite/test-web-references        RUNNING
[INFO] web-testsuite/test-web-references        SUCCESS (0:00:38.587) 
[INFO] webservices-testsuite/jaxb-tests         RUNNING
[INFO] webservices-testsuite/jaxb-tests         SUCCESS (0:00:51.806) 
[INFO] webservices-testsuite/jaxr-tests         RUNNING
[INFO] webservices-testsuite/jaxr-tests         SUCCESS (0:00:51.733) 
[INFO] webservices-testsuite/jaxrpc-jaxws-tests RUNNING
[INFO] webservices-testsuite/jaxrpc-jaxws-tests SUCCESS (0:00:31.411) 
[INFO] webservices-testsuite/jaxrpc-tests       RUNNING
[INFO] webservices-testsuite/jaxrpc-tests       SUCCESS (0:00:41.687) 
[INFO] webservices-testsuite/jaxws-tests        RUNNING
[INFO] webservices-testsuite/jaxws-tests        SUCCESS (0:01:35.653) 
[INFO] webservices-testsuite/jaxws-wsa-tests    RUNNING
[INFO] webservices-testsuite/jaxws-wsa-tests    SUCCESS (0:00:48.567) 
[INFO] webservices-testsuite/saaj-tests         RUNNING
[INFO] webservices-testsuite/saaj-tests         SUCCESS (0:00:37.921) 
[INFO] webservices-testsuite/stax-tests         RUNNING
[INFO] webservices-testsuite/stax-tests         SUCCESS (0:00:52.779) 
[INFO] 
[INFO] -------------------------------------------------------------------------------
[INFO] Test Summary (0:41:22.763)
[INFO]     Passed: 32
[INFO]     Failed: 1
[INFO] -------------------------------------------------------------------------------
[INFO] 
[INFO] The following tests failed:
[INFO]     * security-testsuite/test-security - /home/geronimo/geronimo/trunk/testsuite/security-testsuite/test-security/build.log
[INFO] 
[INFO] ------------------------------------------------------------------------
[ERROR] BUILD ERROR
 
Assembly: jetty
=================================
See the full test.log file at http://people.apache.org/builds/geronimo/server/binaries/trunk/20081130/logs-2100-jetty/test.log
 
 
[INFO] Selected option set: default
[INFO] Redirecting output to: /home/geronimo/geronimo/trunk/testsuite/target/geronimo-logs/org.apache.geronimo.mavenplugins.geronimo.server.StartServerMojo.log
[INFO] Waiting for Geronimo server...
[INFO] Geronimo server started in 0:00:45.364
[INFO] [shitty:install {execution: default}]
[INFO] Installing /home/geronimo/geronimo/trunk/testsuite/pom.xml to /home/geronimo/.m2/repository/org/apache/geronimo/testsuite/testsuite/2.2-SNAPSHOT/testsuite-2.2-SNAPSHOT.pom
[INFO] [shitty:test {execution: default}]
[INFO] Starting 33 test build(s)
[INFO] 
[INFO] -------------------------------------------------------------------------------
[INFO] 
[INFO] commands-testsuite/deploy                RUNNING
[INFO] commands-testsuite/deploy                SUCCESS (0:00:56.243) 
[INFO] commands-testsuite/gshell                RUNNING
[INFO] commands-testsuite/gshell                SUCCESS (0:00:27.738) 
[INFO] commands-testsuite/jaxws                 RUNNING
[INFO] commands-testsuite/jaxws                 SUCCESS (0:00:31.960) 
[INFO] commands-testsuite/shutdown              RUNNING
[INFO] commands-testsuite/shutdown              SUCCESS (0:00:15.945) 
[INFO] concurrent-testsuite/concurrent-basic    RUNNING
[INFO] concurrent-testsuite/concurrent-basic    SUCCESS (0:06:19.936) 
[INFO] console-testsuite/advanced               RUNNING
[INFO] console-testsuite/advanced               FAILURE (0:01:32.695) Java returned: 1
[INFO] console-testsuite/basic                  RUNNING
[INFO] console-testsuite/basic                  SUCCESS (0:01:46.613) 
[INFO] corba-testsuite/corba-helloworld         RUNNING
[INFO] corba-testsuite/corba-helloworld         SUCCESS (0:00:43.468) 
[INFO] corba-testsuite/corba-marshal            RUNNING
[INFO] corba-testsuite/corba-marshal            SUCCESS (0:01:06.093) 
[INFO] corba-testsuite/corba-mytime             RUNNING
[INFO] corba-testsuite/corba-mytime             SUCCESS (0:00:45.056) 
[INFO] deployment-testsuite/deployment-tests    RUNNING
[INFO] deployment-testsuite/deployment-tests    SUCCESS (0:00:28.871) 
[INFO] deployment-testsuite/jca-cms-tests       RUNNING
[INFO] deployment-testsuite/jca-cms-tests       SUCCESS (0:00:27.021) 
[INFO] deployment-testsuite/manifestcp-tests    RUNNING
[INFO] deployment-testsuite/manifestcp-tests    SUCCESS (0:00:31.177) 
[INFO] enterprise-testsuite/ejb-tests           RUNNING
[INFO] enterprise-testsuite/ejb-tests           SUCCESS (0:00:35.137) 
[INFO] enterprise-testsuite/jms-tests           RUNNING
[INFO] enterprise-testsuite/jms-tests           SUCCESS (0:00:49.460) 
[INFO] enterprise-testsuite/jpa-tests           RUNNING
[INFO] enterprise-testsuite/jpa-tests           SUCCESS (0:00:41.926) 
[INFO] enterprise-testsuite/sec-client          RUNNING
[INFO] enterprise-testsuite/sec-client          SUCCESS (0:00:25.990) 
[INFO] enterprise-testsuite/sec-tests           RUNNING
[INFO] enterprise-testsuite/sec-tests           SUCCESS (0:00:50.584) 
[INFO] security-testsuite/test-security         RUNNING
[INFO] security-testsuite/test-security         FAILURE (0:00:33.379) Java returned: 1
[INFO] web-testsuite/test-2.1-jsps              RUNNING
[INFO] web-testsuite/test-2.1-jsps              SUCCESS (0:00:33.994) 
[INFO] web-testsuite/test-2.5-servlets          RUNNING
[INFO] web-testsuite/test-2.5-servlets          SUCCESS (0:00:26.330) 
[INFO] web-testsuite/test-jetty                 RUNNING
[INFO] web-testsuite/test-jetty                 SUCCESS (0:00:20.629) 
[INFO] web-testsuite/test-myfaces               RUNNING
[INFO] web-testsuite/test-myfaces               FAILURE (0:00:24.288) Java returned: 1
[INFO] web-testsuite/test-web-forward           RUNNING
[INFO] web-testsuite/test-web-forward           FAILURE (0:00:27.456) Java returned: 1
[INFO] web-testsuite/test-web-references        RUNNING
[INFO] web-testsuite/test-web-references        FAILURE (0:00:28.693) Java returned: 1
[INFO] webservices-testsuite/jaxb-tests         RUNNING
[INFO] webservices-testsuite/jaxb-tests         FAILURE (0:00:19.949) Java returned: 1
[INFO] webservices-testsuite/jaxr-tests         RUNNING
[INFO] webservices-testsuite/jaxr-tests         FAILURE (0:00:19.373) Java returned: 1
[INFO] webservices-testsuite/jaxrpc-jaxws-tests RUNNING
[INFO] webservices-testsuite/jaxrpc-jaxws-tests FAILURE (0:00:19.558) Java returned: 1
[INFO] webservices-testsuite/jaxrpc-tests       RUNNING
[INFO] webservices-testsuite/jaxrpc-tests       FAILURE (0:00:18.621) Java returned: 1
[INFO] webservices-testsuite/jaxws-tests        RUNNING
[INFO] webservices-testsuite/jaxws-tests        FAILURE (0:00:21.157) Java returned: 1
[INFO] webservices-testsuite/jaxws-wsa-tests    RUNNING
[INFO] webservices-testsuite/jaxws-wsa-tests    FAILURE (0:00:25.902) Java returned: 1
[INFO] webservices-testsuite/saaj-tests         RUNNING
[INFO] webservices-testsuite/saaj-tests         FAILURE (0:00:19.635) Java returned: 1
[INFO] webservices-testsuite/stax-tests         RUNNING
[INFO] webservices-testsuite/stax-tests         FAILURE (0:00:20.049) Java returned: 1
[INFO] 
[INFO] -------------------------------------------------------------------------------
[INFO] Test Summary (0:25:15.119)
[INFO]     Passed: 20
[INFO]     Failed: 13
[INFO] -------------------------------------------------------------------------------
[INFO] 
[INFO] The following tests failed:
[INFO]     * console-testsuite/advanced - /home/geronimo/geronimo/trunk/testsuite/console-testsuite/advanced/build.log
[INFO]     * security-testsuite/test-security - /home/geronimo/geronimo/trunk/testsuite/security-testsuite/test-security/build.log
[INFO]     * web-testsuite/test-myfaces - /home/geronimo/geronimo/trunk/testsuite/web-testsuite/test-myfaces/build.log
[INFO]     * web-testsuite/test-web-forward - /home/geronimo/geronimo/trunk/testsuite/web-testsuite/test-web-forward/build.log
[INFO]     * web-testsuite/test-web-references - /home/geronimo/geronimo/trunk/testsuite/web-testsuite/test-web-references/build.log
[INFO]     * webservices-testsuite/jaxb-tests - /home/geronimo/geronimo/trunk/testsuite/webservices-testsuite/jaxb-tests/build.log
[INFO]     * webservices-testsuite/jaxr-tests - /home/geronimo/geronimo/trunk/testsuite/webservices-testsuite/jaxr-tests/build.log
[INFO]     * webservices-testsuite/jaxrpc-jaxws-tests - /home/geronimo/geronimo/trunk/testsuite/webservices-testsuite/jaxrpc-jaxws-tests/build.log
[INFO]     * webservices-testsuite/jaxrpc-tests - /home/geronimo/geronimo/trunk/testsuite/webservices-testsuite/jaxrpc-tests/build.log
[INFO]     * webservices-testsuite/jaxws-tests - /home/geronimo/geronimo/trunk/testsuite/webservices-testsuite/jaxws-tests/build.log
[INFO]     * webservices-testsuite/jaxws-wsa-tests - /home/geronimo/geronimo/trunk/testsuite/webservices-testsuite/jaxws-wsa-tests/build.log
[INFO]     * webservices-testsuite/saaj-tests - /home/geronimo/geronimo/trunk/testsuite/webservices-testsuite/saaj-tests/build.log
[INFO]     * webservices-testsuite/stax-tests - /home/geronimo/geronimo/trunk/testsuite/webservices-testsuite/stax-tests/build.log
[INFO] 
[INFO] ------------------------------------------------------------------------
[ERROR] BUILD ERROR
 
Samples: trunk
=================================
Log: http://people.apache.org/builds/geronimo/server/binaries/trunk/20081130/samples-2100.log
 
Build status: OK
 

Mime
View raw message