geronimo-dev mailing list archives

Site index · List index
Message view « Date » · « Thread »
Top « Date » · « Thread »
From ga...@apache.org
Subject [BUILD] trunk: Failed for Revision: 701577
Date Sat, 04 Oct 2008 01:34:55 GMT
Geronimo Revision: 701577 built with tests included
 
See the full build-2100.log file at http://people.apache.org/builds/geronimo/server/binaries/trunk/20081003/build-2100.log
 
 
See the unit test reports at http://people.apache.org/builds/geronimo/server/binaries/trunk/20081003/unit-test-reports
 
Downloading: http://repo1.maven.org/maven2/org/apache/neethi/neethi/2.0/neethi-2.0.jar
42K downloaded
Downloading: http://people.apache.org/repo/m2-snapshot-repository/org/apache/woden/woden-api/1.0-SNAPSHOT/woden-api-1.0-SNAPSHOT.jar
145K downloaded
Downloading: http://people.apache.org/repo/m2-snapshot-repository/org/apache/woden/woden-impl-dom/1.0-SNAPSHOT/woden-impl-dom-1.0-SNAPSHOT.jar
220K downloaded
Downloading: http://people.apache.org/repo/m2-snapshot-repository/org/apache/axis2/axis2-saaj/SNAPSHOT/axis2-saaj-SNAPSHOT.jar
85K downloaded
Downloading: http://people.apache.org/repo/m2-snapshot-repository/org/apache/axis2/axis2-transport-http/SNAPSHOT/axis2-transport-http-SNAPSHOT.jar
126K downloaded
Downloading: http://download.java.net/maven/1//org.apache.httpcomponents/jars/httpcore-4.0-beta1.jar
Downloading: http://people.apache.org/repo/m2-incubating-repository//org/apache/httpcomponents/httpcore/4.0-beta1/httpcore-4.0-beta1.jar
Downloading: http://repo1.maven.org/maven2/org/apache/httpcomponents/httpcore/4.0-beta1/httpcore-4.0-beta1.jar
164K downloaded
Downloading: http://people.apache.org/repo/m2-snapshot-repository/org/apache/axis2/axis2-transport-base/SNAPSHOT/axis2-transport-base-SNAPSHOT.jar
61K downloaded
Downloading: http://people.apache.org/repo/m2-snapshot-repository/org/apache/axis2/axis2-transport-tcp/SNAPSHOT/axis2-transport-tcp-SNAPSHOT.jar
10K downloaded
Downloading: http://people.apache.org/repo/m2-snapshot-repository/org/apache/axis2/axis2-transport-local/SNAPSHOT/axis2-transport-local-SNAPSHOT.jar
9K downloaded
Downloading: http://people.apache.org/repo/m2-snapshot-repository/org/apache/axis2/axis2-metadata/SNAPSHOT/axis2-metadata-SNAPSHOT.jar
761K downloaded
Downloading: http://download.java.net/maven/1//com.sun.xml.bind/jars/jaxb-xjc-2.1.7.jar
3053K downloaded
Downloading: http://people.apache.org/repo/m2-snapshot-repository/org/apache/axis2/axis2-java2wsdl/SNAPSHOT/axis2-java2wsdl-SNAPSHOT.jar
20K downloaded
Downloading: http://people.apache.org/repo/m2-snapshot-repository/org/apache/axis2/axis2-adb/SNAPSHOT/axis2-adb-SNAPSHOT.jar
753K downloaded
Downloading: http://download.java.net/maven/1//annogen/jars/annogen-0.1.0.jar
Downloading: http://people.apache.org/repo/m2-incubating-repository//annogen/annogen/0.1.0/annogen-0.1.0.jar
Downloading: http://repo1.maven.org/maven2/annogen/annogen/0.1.0/annogen-0.1.0.jar
242K downloaded
[INFO] [enforcer:enforce {execution: default}]
[INFO] [remote-resources:process {execution: process}]
[INFO] [remote-resources:process {execution: default}]
[INFO] [resources:resources]
[INFO] Using default encoding to copy filtered resources.
[INFO] [compiler:compile]
[INFO] Compiling 17 source files to /home/geronimo/geronimo/trunk/plugins/axis2/geronimo-axis2/target/classes
[INFO] [resources:testResources]
[INFO] Using default encoding to copy filtered resources.
[INFO] [compiler:testCompile]
[INFO] Compiling 7 source files to /home/geronimo/geronimo/trunk/plugins/axis2/geronimo-axis2/target/test-classes
[INFO] [surefire:test]
[INFO] Surefire report directory: /home/geronimo/geronimo/trunk/plugins/axis2/geronimo-axis2/target/surefire-reports

-------------------------------------------------------
 T E S T S
-------------------------------------------------------
Running org.apache.geronimo.axis2.Axis2WebServiceContainerTest
Tests run: 3, Failures: 0, Errors: 2, Skipped: 0, Time elapsed: 1.007 sec <<< FAILURE!

Results :

Tests in error: 
  testRPCInvokeWithWSDL(org.apache.geronimo.axis2.Axis2WebServiceContainerTest)
  testGetWSDL(org.apache.geronimo.axis2.Axis2WebServiceContainerTest)

Tests run: 3, Failures: 0, Errors: 2, Skipped: 0

[INFO] ------------------------------------------------------------------------
[ERROR] BUILD FAILURE
[INFO] ------------------------------------------------------------------------
[INFO] There are test failures.

Please refer to /home/geronimo/geronimo/trunk/plugins/axis2/geronimo-axis2/target/surefire-reports
for the individual test results.
[INFO] ------------------------------------------------------------------------
[INFO] Trace
org.apache.maven.BuildFailureException: There are test failures.

Please refer to /home/geronimo/geronimo/trunk/plugins/axis2/geronimo-axis2/target/surefire-reports
for the individual test results.
	at org.apache.maven.lifecycle.DefaultLifecycleExecutor.executeGoals(DefaultLifecycleExecutor.java:579)
	at org.apache.maven.lifecycle.DefaultLifecycleExecutor.executeGoalWithLifecycle(DefaultLifecycleExecutor.java:499)
	at org.apache.maven.lifecycle.DefaultLifecycleExecutor.executeGoal(DefaultLifecycleExecutor.java:478)
	at org.apache.maven.lifecycle.DefaultLifecycleExecutor.executeGoalAndHandleFailures(DefaultLifecycleExecutor.java:330)
	at org.apache.maven.lifecycle.DefaultLifecycleExecutor.executeTaskSegments(DefaultLifecycleExecutor.java:291)
	at org.apache.maven.lifecycle.DefaultLifecycleExecutor.execute(DefaultLifecycleExecutor.java:142)
	at org.apache.maven.DefaultMaven.doExecute(DefaultMaven.java:336)
	at org.apache.maven.DefaultMaven.execute(DefaultMaven.java:129)
	at org.apache.maven.cli.MavenCli.main(MavenCli.java:287)
	at sun.reflect.NativeMethodAccessorImpl.invoke0(Native Method)
	at sun.reflect.NativeMethodAccessorImpl.invoke(NativeMethodAccessorImpl.java:39)
	at sun.reflect.DelegatingMethodAccessorImpl.invoke(DelegatingMethodAccessorImpl.java:25)
	at java.lang.reflect.Method.invoke(Method.java:585)
	at org.codehaus.classworlds.Launcher.launchEnhanced(Launcher.java:315)
	at org.codehaus.classworlds.Launcher.launch(Launcher.java:255)
	at org.codehaus.classworlds.Launcher.mainWithExitCode(Launcher.java:430)
	at org.codehaus.classworlds.Launcher.main(Launcher.java:375)
Caused by: org.apache.maven.plugin.MojoFailureException: There are test failures.

Please refer to /home/geronimo/geronimo/trunk/plugins/axis2/geronimo-axis2/target/surefire-reports
for the individual test results.
	at org.apache.maven.plugin.surefire.SurefirePlugin.execute(SurefirePlugin.java:530)
	at org.apache.maven.plugin.DefaultPluginManager.executeMojo(DefaultPluginManager.java:451)
	at org.apache.maven.lifecycle.DefaultLifecycleExecutor.executeGoals(DefaultLifecycleExecutor.java:558)
	... 16 more
[INFO] ------------------------------------------------------------------------
[INFO] Total time: 19 minutes 46 seconds
[INFO] Finished at: Fri Oct 03 21:22:10 EDT 2008
[INFO] Final Memory: 327M/562M
[INFO] ------------------------------------------------------------------------

Mime
View raw message