geronimo-dev mailing list archives

Site index · List index
Message view « Date » · « Thread »
Top « Date » · « Thread »
From David Jencks <david_jen...@yahoo.com>
Subject Re: [BUILD] trunk: Failed for Revision: 697413
Date Sun, 21 Sep 2008 00:52:19 GMT
I think I've fixed at least the offline-deployer error in rev 697438.   
I still haven't figured out how to run the testsuite against ff3 so  
got stuck before the second error.... but at least I have a better  
idea how to fix these problems now.

thanks
david jencks

On Sep 20, 2008, at 2:02 PM, gawor@apache.org wrote:

> Geronimo Revision: 697413 built with tests included
>
> See the full build-1500.log file at http://people.apache.org/builds/geronimo/server/binaries/trunk/20080920/build-1500.log
>
> Download the binaries from http://people.apache.org/builds/geronimo/server/binaries/trunk/20080920
> [INFO] BUILD SUCCESSFUL
> [INFO]  
> ------------------------------------------------------------------------
> [INFO] Total time: 38 minutes 16 seconds
> [INFO] Finished at: Sat Sep 20 15:41:55 EDT 2008
> [INFO] Final Memory: 376M/999M
> [INFO]  
> ------------------------------------------------------------------------
>
> TESTSUITE RESULTS (Failures only)
> =================================
> See detailed results at http://people.apache.org/builds/geronimo/server/testsuite/ResultsSummary.html
>
> Assembly: tomcat
> =================================
> See the full test.log file at http://people.apache.org/builds/geronimo/server/binaries/trunk/20080920/logs-1500-tomcat/test.log
>
>
> [INFO] Redirecting output to: /home/geronimo/geronimo/trunk/ 
> testsuite/target/selenium/server.log
> [INFO] User extensions: /home/geronimo/geronimo/trunk/testsuite/ 
> target/selenium/user-extensions.js
> Selenium Server started
> [INFO] [geronimo:start-server {execution: start}]
> [INFO] Using assembly configuration: tomcat
> [INFO] snapshot org.apache.geronimo.assemblies:geronimo-tomcat6- 
> javaee5:2.2-SNAPSHOT: checking for updates from apache-snapshots
> [INFO] snapshot org.apache.geronimo.assemblies:geronimo-tomcat6- 
> javaee5:2.2-SNAPSHOT: checking for updates from codehaus-snapshots
> [INFO] snapshot org.apache.geronimo.assemblies:geronimo-tomcat6- 
> javaee5:2.2-SNAPSHOT: checking for updates from apache.snapshots
> [INFO] Using assembly artifact:  
> org.apache.geronimo.assemblies:geronimo-tomcat6-javaee5:zip:bin:2.2- 
> SNAPSHOT:provided
> [INFO] Using geronimoHome: /home/geronimo/geronimo/trunk/testsuite/ 
> target/geronimo-tomcat6-javaee5-2.2-SNAPSHOT
> [INFO] Installing assembly...
> [INFO] Expanding: /home/geronimo/.m2/repository/org/apache/geronimo/ 
> assemblies/geronimo-tomcat6-javaee5/2.2-SNAPSHOT/geronimo-tomcat6- 
> javaee5-2.2-SNAPSHOT-bin.zip into /home/geronimo/geronimo/trunk/ 
> testsuite/target
> [INFO] Starting Geronimo server...
> [INFO] Selected option set: default
> [INFO] Redirecting output to: /home/geronimo/geronimo/trunk/ 
> testsuite/target/geronimo-logs/ 
> org.apache.geronimo.mavenplugins.geronimo.server.StartServerMojo.log
> [INFO] Waiting for Geronimo server...
> [INFO] Geronimo server started in 0:00:40.025
> [INFO] [shitty:install {execution: default}]
> [INFO] Installing /home/geronimo/geronimo/trunk/testsuite/pom.xml  
> to /home/geronimo/.m2/repository/org/apache/geronimo/testsuite/ 
> testsuite/2.2-SNAPSHOT/testsuite-2.2-SNAPSHOT.pom
> [INFO] [shitty:test {execution: default}]
> [INFO] Starting 32 test build(s)
> [INFO]
> [INFO]  
> -------------------------------------------------------------------------------
> [INFO]
> [INFO] commands-testsuite/deploy                RUNNING
> [INFO] commands-testsuite/deploy                FAILURE  
> (0:01:07.214) Java returned: 1
> [INFO] commands-testsuite/gshell                RUNNING
> [INFO] commands-testsuite/gshell                SUCCESS (0:00:29.634)
> [INFO] commands-testsuite/jaxws                 RUNNING
> [INFO] commands-testsuite/jaxws                 SUCCESS (0:00:19.090)
> [INFO] commands-testsuite/shutdown              RUNNING
> [INFO] commands-testsuite/shutdown              SUCCESS (0:00:16.757)
> [INFO] concurrent-testsuite/concurrent-basic    RUNNING
> [INFO] concurrent-testsuite/concurrent-basic    SUCCESS (0:06:13.243)
> [INFO] console-testsuite/advanced               RUNNING
> [INFO] console-testsuite/advanced               FAILURE  
> (0:00:50.671) Java returned: 1
> [INFO] console-testsuite/basic                  RUNNING
> [INFO] console-testsuite/basic                  SUCCESS (0:01:47.248)
> [INFO] corba-testsuite/corba-helloworld         RUNNING
> [INFO] corba-testsuite/corba-helloworld         SUCCESS (0:00:44.089)
> [INFO] corba-testsuite/corba-marshal            RUNNING
> [INFO] corba-testsuite/corba-marshal            SUCCESS (0:01:04.160)
> [INFO] corba-testsuite/corba-mytime             RUNNING
> [INFO] corba-testsuite/corba-mytime             SUCCESS (0:00:44.108)
> [INFO] deployment-testsuite/deployment-tests    RUNNING
> [INFO] deployment-testsuite/deployment-tests    SUCCESS (0:00:32.259)
> [INFO] deployment-testsuite/jca-cms-tests       RUNNING
> [INFO] deployment-testsuite/jca-cms-tests       SUCCESS (0:00:27.503)
> [INFO] deployment-testsuite/manifestcp-tests    RUNNING
> [INFO] deployment-testsuite/manifestcp-tests    SUCCESS (0:00:28.763)
> [INFO] enterprise-testsuite/ejb-tests           RUNNING
> [INFO] enterprise-testsuite/ejb-tests           SUCCESS (0:00:43.315)
> [INFO] enterprise-testsuite/jms-tests           RUNNING
> [INFO] enterprise-testsuite/jms-tests           SUCCESS (0:00:47.270)
> [INFO] enterprise-testsuite/jpa-tests           RUNNING
> [INFO] enterprise-testsuite/jpa-tests           SUCCESS (0:00:51.281)
> [INFO] enterprise-testsuite/sec-client          RUNNING
> [INFO] enterprise-testsuite/sec-client          SUCCESS (0:00:27.432)
> [INFO] enterprise-testsuite/sec-tests           RUNNING
> [INFO] enterprise-testsuite/sec-tests           SUCCESS (0:00:51.038)
> [INFO] security-testsuite/test-security         RUNNING
> [INFO] security-testsuite/test-security         SUCCESS (0:00:40.005)
> [INFO] web-testsuite/test-2.1-jsps              RUNNING
> [INFO] web-testsuite/test-2.1-jsps              SUCCESS (0:00:35.231)
> [INFO] web-testsuite/test-2.5-servlets          RUNNING
> [INFO] web-testsuite/test-2.5-servlets          SUCCESS (0:00:26.236)
> [INFO] web-testsuite/test-myfaces               RUNNING
> [INFO] web-testsuite/test-myfaces               SUCCESS (0:00:33.342)
> [INFO] web-testsuite/test-tomcat                RUNNING
> [INFO] web-testsuite/test-tomcat                SUCCESS (0:00:20.046)
> [INFO] web-testsuite/test-web-forward           RUNNING
> [INFO] web-testsuite/test-web-forward           SUCCESS (0:00:30.876)
> [INFO] web-testsuite/test-web-references        RUNNING
> [INFO] web-testsuite/test-web-references        SUCCESS (0:00:36.343)
> [INFO] webservices-testsuite/jaxb-tests         RUNNING
> [INFO] webservices-testsuite/jaxb-tests         SUCCESS (0:00:51.981)
> [INFO] webservices-testsuite/jaxr-tests         RUNNING
> [INFO] webservices-testsuite/jaxr-tests         SUCCESS (0:00:50.350)
> [INFO] webservices-testsuite/jaxrpc-jaxws-tests RUNNING
> [INFO] webservices-testsuite/jaxrpc-jaxws-tests SUCCESS (0:00:30.184)
> [INFO] webservices-testsuite/jaxrpc-tests       RUNNING
> [INFO] webservices-testsuite/jaxrpc-tests       SUCCESS (0:00:37.578)
> [INFO] webservices-testsuite/jaxws-tests        RUNNING
> [INFO] webservices-testsuite/jaxws-tests        SUCCESS (0:01:36.640)
> [INFO] webservices-testsuite/saaj-tests         RUNNING
> [INFO] webservices-testsuite/saaj-tests         SUCCESS (0:00:37.148)
> [INFO] webservices-testsuite/stax-tests         RUNNING
> [INFO] webservices-testsuite/stax-tests         SUCCESS (0:00:50.939)
> [INFO]
> [INFO]  
> -------------------------------------------------------------------------------
> [INFO] Test Summary (0:28:22.161)
> [INFO]     Passed: 30
> [INFO]     Failed: 2
> [INFO]  
> -------------------------------------------------------------------------------
> [INFO]
> [INFO] The following tests failed:
> [INFO]     * commands-testsuite/deploy - /home/geronimo/geronimo/ 
> trunk/testsuite/commands-testsuite/deploy/build.log
> [INFO]     * console-testsuite/advanced - /home/geronimo/geronimo/ 
> trunk/testsuite/console-testsuite/advanced/build.log
> [INFO]
> [INFO]  
> ------------------------------------------------------------------------
> [ERROR] BUILD ERROR
>
> Assembly: jetty
> =================================
> See the full test.log file at http://people.apache.org/builds/geronimo/server/binaries/trunk/20080920/logs-1500-jetty/test.log
>
>
> [INFO] Redirecting output to: /home/geronimo/geronimo/trunk/ 
> testsuite/target/selenium/server.log
> [INFO] User extensions: /home/geronimo/geronimo/trunk/testsuite/ 
> target/selenium/user-extensions.js
> Selenium Server started
> [INFO] [geronimo:start-server {execution: start}]
> [INFO] Using assembly configuration: jetty
> [INFO] snapshot org.apache.geronimo.assemblies:geronimo-jetty6- 
> javaee5:2.2-SNAPSHOT: checking for updates from apache-snapshots
> [INFO] snapshot org.apache.geronimo.assemblies:geronimo-jetty6- 
> javaee5:2.2-SNAPSHOT: checking for updates from codehaus-snapshots
> [INFO] snapshot org.apache.geronimo.assemblies:geronimo-jetty6- 
> javaee5:2.2-SNAPSHOT: checking for updates from apache.snapshots
> [INFO] Using assembly artifact:  
> org.apache.geronimo.assemblies:geronimo-jetty6-javaee5:zip:bin:2.2- 
> SNAPSHOT:provided
> [INFO] Using geronimoHome: /home/geronimo/geronimo/trunk/testsuite/ 
> target/geronimo-jetty6-javaee5-2.2-SNAPSHOT
> [INFO] Installing assembly...
> [INFO] Expanding: /home/geronimo/.m2/repository/org/apache/geronimo/ 
> assemblies/geronimo-jetty6-javaee5/2.2-SNAPSHOT/geronimo-jetty6- 
> javaee5-2.2-SNAPSHOT-bin.zip into /home/geronimo/geronimo/trunk/ 
> testsuite/target
> [INFO] Starting Geronimo server...
> [INFO] Selected option set: default
> [INFO] Redirecting output to: /home/geronimo/geronimo/trunk/ 
> testsuite/target/geronimo-logs/ 
> org.apache.geronimo.mavenplugins.geronimo.server.StartServerMojo.log
> [INFO] Waiting for Geronimo server...
> [INFO] Geronimo server started in 0:00:40.561
> [INFO] [shitty:install {execution: default}]
> [INFO] Installing /home/geronimo/geronimo/trunk/testsuite/pom.xml  
> to /home/geronimo/.m2/repository/org/apache/geronimo/testsuite/ 
> testsuite/2.2-SNAPSHOT/testsuite-2.2-SNAPSHOT.pom
> [INFO] [shitty:test {execution: default}]
> [INFO] Starting 32 test build(s)
> [INFO]
> [INFO]  
> -------------------------------------------------------------------------------
> [INFO]
> [INFO] commands-testsuite/deploy                RUNNING
> [INFO] commands-testsuite/deploy                FAILURE  
> (0:01:06.438) Java returned: 1
> [INFO] commands-testsuite/gshell                RUNNING
> [INFO] commands-testsuite/gshell                SUCCESS (0:00:30.631)
> [INFO] commands-testsuite/jaxws                 RUNNING
> [INFO] commands-testsuite/jaxws                 SUCCESS (0:00:19.390)
> [INFO] commands-testsuite/shutdown              RUNNING
> [INFO] commands-testsuite/shutdown              SUCCESS (0:00:16.619)
> [INFO] concurrent-testsuite/concurrent-basic    RUNNING
> [INFO] concurrent-testsuite/concurrent-basic    SUCCESS (0:06:08.383)
> [INFO] console-testsuite/advanced               RUNNING
> [INFO] console-testsuite/advanced               FAILURE  
> (0:00:48.836) Java returned: 1
> [INFO] console-testsuite/basic                  RUNNING
> [INFO] console-testsuite/basic                  SUCCESS (0:01:54.557)
> [INFO] corba-testsuite/corba-helloworld         RUNNING
> [INFO] corba-testsuite/corba-helloworld         SUCCESS (0:00:43.742)
> [INFO] corba-testsuite/corba-marshal            RUNNING
> [INFO] corba-testsuite/corba-marshal            SUCCESS (0:00:52.442)
> [INFO] corba-testsuite/corba-mytime             RUNNING
> [INFO] corba-testsuite/corba-mytime             SUCCESS (0:00:45.658)
> [INFO] deployment-testsuite/deployment-tests    RUNNING
> [INFO] deployment-testsuite/deployment-tests    SUCCESS (0:00:31.652)
> [INFO] deployment-testsuite/jca-cms-tests       RUNNING
> [INFO] deployment-testsuite/jca-cms-tests       SUCCESS (0:00:28.061)
> [INFO] deployment-testsuite/manifestcp-tests    RUNNING
> [INFO] deployment-testsuite/manifestcp-tests    SUCCESS (0:00:30.642)
> [INFO] enterprise-testsuite/ejb-tests           RUNNING
> [INFO] enterprise-testsuite/ejb-tests           SUCCESS (0:00:34.842)
> [INFO] enterprise-testsuite/jms-tests           RUNNING
> [INFO] enterprise-testsuite/jms-tests           SUCCESS (0:00:47.141)
> [INFO] enterprise-testsuite/jpa-tests           RUNNING
> [INFO] enterprise-testsuite/jpa-tests           SUCCESS (0:00:39.045)
> [INFO] enterprise-testsuite/sec-client          RUNNING
> [INFO] enterprise-testsuite/sec-client          SUCCESS (0:00:27.292)
> [INFO] enterprise-testsuite/sec-tests           RUNNING
> [INFO] enterprise-testsuite/sec-tests           SUCCESS (0:00:48.455)
> [INFO] security-testsuite/test-security         RUNNING
> [INFO] security-testsuite/test-security         SUCCESS (0:00:40.119)
> [INFO] web-testsuite/test-2.1-jsps              RUNNING
> [INFO] web-testsuite/test-2.1-jsps              SUCCESS (0:00:37.017)
> [INFO] web-testsuite/test-2.5-servlets          RUNNING
> [INFO] web-testsuite/test-2.5-servlets          SUCCESS (0:00:26.572)
> [INFO] web-testsuite/test-jetty                 RUNNING
> [INFO] web-testsuite/test-jetty                 SUCCESS (0:00:20.579)
> [INFO] web-testsuite/test-myfaces               RUNNING
> [INFO] web-testsuite/test-myfaces               SUCCESS (0:00:33.157)
> [INFO] web-testsuite/test-web-forward           RUNNING
> [INFO] web-testsuite/test-web-forward           SUCCESS (0:00:31.690)
> [INFO] web-testsuite/test-web-references        RUNNING
> [INFO] web-testsuite/test-web-references        SUCCESS (0:00:38.055)
> [INFO] webservices-testsuite/jaxb-tests         RUNNING
> [INFO] webservices-testsuite/jaxb-tests         SUCCESS (0:00:52.127)
> [INFO] webservices-testsuite/jaxr-tests         RUNNING
> [INFO] webservices-testsuite/jaxr-tests         SUCCESS (0:00:51.525)
> [INFO] webservices-testsuite/jaxrpc-jaxws-tests RUNNING
> [INFO] webservices-testsuite/jaxrpc-jaxws-tests SUCCESS (0:00:28.666)
> [INFO] webservices-testsuite/jaxrpc-tests       RUNNING
> [INFO] webservices-testsuite/jaxrpc-tests       SUCCESS (0:00:38.474)
> [INFO] webservices-testsuite/jaxws-tests        RUNNING
> [INFO] webservices-testsuite/jaxws-tests        SUCCESS (0:01:25.661)
> [INFO] webservices-testsuite/saaj-tests         RUNNING
> [INFO] webservices-testsuite/saaj-tests         SUCCESS (0:00:38.722)
> [INFO] webservices-testsuite/stax-tests         RUNNING
> [INFO] webservices-testsuite/stax-tests         SUCCESS (0:00:52.059)
> [INFO]
> [INFO]  
> -------------------------------------------------------------------------------
> [INFO] Test Summary (0:27:48.437)
> [INFO]     Passed: 30
> [INFO]     Failed: 2
> [INFO]  
> -------------------------------------------------------------------------------
> [INFO]
> [INFO] The following tests failed:
> [INFO]     * commands-testsuite/deploy - /home/geronimo/geronimo/ 
> trunk/testsuite/commands-testsuite/deploy/build.log
> [INFO]     * console-testsuite/advanced - /home/geronimo/geronimo/ 
> trunk/testsuite/console-testsuite/advanced/build.log
> [INFO]
> [INFO]  
> ------------------------------------------------------------------------
> [ERROR] BUILD ERROR
>
> Samples: trunk
> =================================
> Log: http://people.apache.org/builds/geronimo/server/binaries/trunk/20080920/samples-1500.log
>
> Build status: OK
>


Mime
View raw message