geronimo-dev mailing list archives

Site index · List index
Message view « Date » · « Thread »
Top « Date » · « Thread »
From Donald Woods <dwo...@apache.org>
Subject Re: [BUILD] trunk: Failed for Revision: 697080
Date Fri, 19 Sep 2008 15:14:29 GMT
The deployer failures are for all the offline tests, which all fail with 
the following -

Exception in thread "main" java.lang.ClassCastException: 
org.apache.geronimo.connector.deployment.RARConfigurer cannot be cast to 
org.apache.geronimo.deployment.ModuleConfigurer
         at 
org.apache.geronimo.deployment.plugin.jmx.LocalDeploymentManager.loadModuleConfigurers(LocalDeploymentManager.java:51)
         at 
org.apache.geronimo.deployment.plugin.jmx.LocalDeploymentManager.<init>(LocalDeploymentManager.java:41)
         at 
org.apache.geronimo.deployment.cli.ServerConnection.<init>(ServerConnection.java:93)
         at 
org.apache.geronimo.deployment.cli.DeployTool.execute(DeployTool.java:161)
         at 
org.apache.geronimo.kernel.util.MainConfigurationBootstrapper.main(MainConfigurationBootstrapper.java:45)
         at 
org.apache.geronimo.cli.AbstractCLI.executeMain(AbstractCLI.java:65)
         at 
org.apache.geronimo.cli.deployer.DeployerCLI.main(DeployerCLI.java:31)


Not sure which change in the past few weeks caused this.....


-Donald


gawor@apache.org wrote:
> Geronimo Revision: 697080 built with tests included
>  
> See the full build-0900.log file at http://people.apache.org/builds/geronimo/server/binaries/trunk/20080919/build-0900.log
>  
> Download the binaries from http://people.apache.org/builds/geronimo/server/binaries/trunk/20080919
> [INFO] BUILD SUCCESSFUL
> [INFO] ------------------------------------------------------------------------
> [INFO] Total time: 38 minutes 27 seconds
> [INFO] Finished at: Fri Sep 19 09:42:51 EDT 2008
> [INFO] Final Memory: 375M/1015M
> [INFO] ------------------------------------------------------------------------
>  
> TESTSUITE RESULTS (Failures only)
> =================================
> See detailed results at http://people.apache.org/builds/geronimo/server/testsuite/ResultsSummary.html
>  
> Assembly: tomcat
> =================================
> See the full test.log file at http://people.apache.org/builds/geronimo/server/binaries/trunk/20080919/logs-0900-tomcat/test.log
>  
>  
> [INFO] Redirecting output to: /home/geronimo/geronimo/trunk/testsuite/target/selenium/server.log
> [INFO] User extensions: /home/geronimo/geronimo/trunk/testsuite/target/selenium/user-extensions.js
> Selenium Server started
> [INFO] [geronimo:start-server {execution: start}]
> [INFO] Using assembly configuration: tomcat
> [INFO] snapshot org.apache.geronimo.assemblies:geronimo-tomcat6-javaee5:2.2-SNAPSHOT:
checking for updates from apache-snapshots
> [INFO] snapshot org.apache.geronimo.assemblies:geronimo-tomcat6-javaee5:2.2-SNAPSHOT:
checking for updates from codehaus-snapshots
> [INFO] snapshot org.apache.geronimo.assemblies:geronimo-tomcat6-javaee5:2.2-SNAPSHOT:
checking for updates from apache.snapshots
> [INFO] Using assembly artifact: org.apache.geronimo.assemblies:geronimo-tomcat6-javaee5:zip:bin:2.2-SNAPSHOT:provided
> [INFO] Using geronimoHome: /home/geronimo/geronimo/trunk/testsuite/target/geronimo-tomcat6-javaee5-2.2-SNAPSHOT
> [INFO] Installing assembly...
> [INFO] Expanding: /home/geronimo/.m2/repository/org/apache/geronimo/assemblies/geronimo-tomcat6-javaee5/2.2-SNAPSHOT/geronimo-tomcat6-javaee5-2.2-SNAPSHOT-bin.zip
into /home/geronimo/geronimo/trunk/testsuite/target
> [INFO] Starting Geronimo server...
> [INFO] Selected option set: default
> [INFO] Redirecting output to: /home/geronimo/geronimo/trunk/testsuite/target/geronimo-logs/org.apache.geronimo.mavenplugins.geronimo.server.StartServerMojo.log
> [INFO] Waiting for Geronimo server...
> [INFO] Geronimo server started in 0:00:38.477
> [INFO] [shitty:install {execution: default}]
> [INFO] Installing /home/geronimo/geronimo/trunk/testsuite/pom.xml to /home/geronimo/.m2/repository/org/apache/geronimo/testsuite/testsuite/2.2-SNAPSHOT/testsuite-2.2-SNAPSHOT.pom
> [INFO] [shitty:test {execution: default}]
> [INFO] Starting 32 test build(s)
> [INFO] 
> [INFO] -------------------------------------------------------------------------------
> [INFO] 
> [INFO] commands-testsuite/deploy                RUNNING
> [INFO] commands-testsuite/deploy                FAILURE (0:01:12.041) Java returned:
1
> [INFO] commands-testsuite/gshell                RUNNING
> [INFO] commands-testsuite/gshell                SUCCESS (0:00:30.213) 
> [INFO] commands-testsuite/jaxws                 RUNNING
> [INFO] commands-testsuite/jaxws                 SUCCESS (0:00:19.960) 
> [INFO] commands-testsuite/shutdown              RUNNING
> [INFO] commands-testsuite/shutdown              SUCCESS (0:00:16.484) 
> [INFO] concurrent-testsuite/concurrent-basic    RUNNING
> [INFO] concurrent-testsuite/concurrent-basic    SUCCESS (0:06:16.309) 
> [INFO] console-testsuite/advanced               RUNNING
> [INFO] console-testsuite/advanced               FAILURE (0:00:50.844) Java returned:
1
> [INFO] console-testsuite/basic                  RUNNING
> [INFO] console-testsuite/basic                  SUCCESS (0:01:46.805) 
> [INFO] corba-testsuite/corba-helloworld         RUNNING
> [INFO] corba-testsuite/corba-helloworld         SUCCESS (0:00:44.251) 
> [INFO] corba-testsuite/corba-marshal            RUNNING
> [INFO] corba-testsuite/corba-marshal            SUCCESS (0:00:49.424) 
> [INFO] corba-testsuite/corba-mytime             RUNNING
> [INFO] corba-testsuite/corba-mytime             SUCCESS (0:00:42.749) 
> [INFO] deployment-testsuite/deployment-tests    RUNNING
> [INFO] deployment-testsuite/deployment-tests    SUCCESS (0:00:31.531) 
> [INFO] deployment-testsuite/jca-cms-tests       RUNNING
> [INFO] deployment-testsuite/jca-cms-tests       SUCCESS (0:00:27.856) 
> [INFO] deployment-testsuite/manifestcp-tests    RUNNING
> [INFO] deployment-testsuite/manifestcp-tests    SUCCESS (0:00:28.657) 
> [INFO] enterprise-testsuite/ejb-tests           RUNNING
> [INFO] enterprise-testsuite/ejb-tests           SUCCESS (0:00:43.014) 
> [INFO] enterprise-testsuite/jms-tests           RUNNING
> [INFO] enterprise-testsuite/jms-tests           SUCCESS (0:00:48.333) 
> [INFO] enterprise-testsuite/jpa-tests           RUNNING
> [INFO] enterprise-testsuite/jpa-tests           SUCCESS (0:00:54.503) 
> [INFO] enterprise-testsuite/sec-client          RUNNING
> [INFO] enterprise-testsuite/sec-client          SUCCESS (0:00:26.099) 
> [INFO] enterprise-testsuite/sec-tests           RUNNING
> [INFO] enterprise-testsuite/sec-tests           SUCCESS (0:00:49.092) 
> [INFO] security-testsuite/test-security         RUNNING
> [INFO] security-testsuite/test-security         SUCCESS (0:00:40.078) 
> [INFO] web-testsuite/test-2.1-jsps              RUNNING
> [INFO] web-testsuite/test-2.1-jsps              SUCCESS (0:00:35.254) 
> [INFO] web-testsuite/test-2.5-servlets          RUNNING
> [INFO] web-testsuite/test-2.5-servlets          SUCCESS (0:00:25.980) 
> [INFO] web-testsuite/test-myfaces               RUNNING
> [INFO] web-testsuite/test-myfaces               SUCCESS (0:00:32.642) 
> [INFO] web-testsuite/test-tomcat                RUNNING
> [INFO] web-testsuite/test-tomcat                SUCCESS (0:00:19.488) 
> [INFO] web-testsuite/test-web-forward           RUNNING
> [INFO] web-testsuite/test-web-forward           SUCCESS (0:00:31.227) 
> [INFO] web-testsuite/test-web-references        RUNNING
> [INFO] web-testsuite/test-web-references        SUCCESS (0:00:36.488) 
> [INFO] webservices-testsuite/jaxb-tests         RUNNING
> [INFO] webservices-testsuite/jaxb-tests         SUCCESS (0:00:50.039) 
> [INFO] webservices-testsuite/jaxr-tests         RUNNING
> [INFO] webservices-testsuite/jaxr-tests         SUCCESS (0:00:49.208) 
> [INFO] webservices-testsuite/jaxrpc-jaxws-tests RUNNING
> [INFO] webservices-testsuite/jaxrpc-jaxws-tests SUCCESS (0:00:29.496) 
> [INFO] webservices-testsuite/jaxrpc-tests       RUNNING
> [INFO] webservices-testsuite/jaxrpc-tests       SUCCESS (0:00:38.249) 
> [INFO] webservices-testsuite/jaxws-tests        RUNNING
> [INFO] webservices-testsuite/jaxws-tests        SUCCESS (0:01:34.740) 
> [INFO] webservices-testsuite/saaj-tests         RUNNING
> [INFO] webservices-testsuite/saaj-tests         SUCCESS (0:00:38.246) 
> [INFO] webservices-testsuite/stax-tests         RUNNING
> [INFO] webservices-testsuite/stax-tests         SUCCESS (0:00:50.768) 
> [INFO] 
> [INFO] -------------------------------------------------------------------------------
> [INFO] Test Summary (0:28:10.249)
> [INFO]     Passed: 30
> [INFO]     Failed: 2
> [INFO] -------------------------------------------------------------------------------
> [INFO] 
> [INFO] The following tests failed:
> [INFO]     * commands-testsuite/deploy - /home/geronimo/geronimo/trunk/testsuite/commands-testsuite/deploy/build.log
> [INFO]     * console-testsuite/advanced - /home/geronimo/geronimo/trunk/testsuite/console-testsuite/advanced/build.log
> [INFO] 
> [INFO] ------------------------------------------------------------------------
> [ERROR] BUILD ERROR
>  
> Assembly: jetty
> =================================
> See the full test.log file at http://people.apache.org/builds/geronimo/server/binaries/trunk/20080919/logs-0900-jetty/test.log
>  
>  
> [INFO] Redirecting output to: /home/geronimo/geronimo/trunk/testsuite/target/selenium/server.log
> [INFO] User extensions: /home/geronimo/geronimo/trunk/testsuite/target/selenium/user-extensions.js
> Selenium Server started
> [INFO] [geronimo:start-server {execution: start}]
> [INFO] Using assembly configuration: jetty
> [INFO] snapshot org.apache.geronimo.assemblies:geronimo-jetty6-javaee5:2.2-SNAPSHOT:
checking for updates from apache-snapshots
> [INFO] snapshot org.apache.geronimo.assemblies:geronimo-jetty6-javaee5:2.2-SNAPSHOT:
checking for updates from codehaus-snapshots
> [INFO] snapshot org.apache.geronimo.assemblies:geronimo-jetty6-javaee5:2.2-SNAPSHOT:
checking for updates from apache.snapshots
> [INFO] Using assembly artifact: org.apache.geronimo.assemblies:geronimo-jetty6-javaee5:zip:bin:2.2-SNAPSHOT:provided
> [INFO] Using geronimoHome: /home/geronimo/geronimo/trunk/testsuite/target/geronimo-jetty6-javaee5-2.2-SNAPSHOT
> [INFO] Installing assembly...
> [INFO] Expanding: /home/geronimo/.m2/repository/org/apache/geronimo/assemblies/geronimo-jetty6-javaee5/2.2-SNAPSHOT/geronimo-jetty6-javaee5-2.2-SNAPSHOT-bin.zip
into /home/geronimo/geronimo/trunk/testsuite/target
> [INFO] Starting Geronimo server...
> [INFO] Selected option set: default
> [INFO] Redirecting output to: /home/geronimo/geronimo/trunk/testsuite/target/geronimo-logs/org.apache.geronimo.mavenplugins.geronimo.server.StartServerMojo.log
> [INFO] Waiting for Geronimo server...
> [INFO] Geronimo server started in 0:00:43.583
> [INFO] [shitty:install {execution: default}]
> [INFO] Installing /home/geronimo/geronimo/trunk/testsuite/pom.xml to /home/geronimo/.m2/repository/org/apache/geronimo/testsuite/testsuite/2.2-SNAPSHOT/testsuite-2.2-SNAPSHOT.pom
> [INFO] [shitty:test {execution: default}]
> [INFO] Starting 32 test build(s)
> [INFO] 
> [INFO] -------------------------------------------------------------------------------
> [INFO] 
> [INFO] commands-testsuite/deploy                RUNNING
> [INFO] commands-testsuite/deploy                FAILURE (0:01:06.951) Java returned:
1
> [INFO] commands-testsuite/gshell                RUNNING
> [INFO] commands-testsuite/gshell                SUCCESS (0:00:30.081) 
> [INFO] commands-testsuite/jaxws                 RUNNING
> [INFO] commands-testsuite/jaxws                 SUCCESS (0:00:18.595) 
> [INFO] commands-testsuite/shutdown              RUNNING
> [INFO] commands-testsuite/shutdown              SUCCESS (0:00:16.524) 
> [INFO] concurrent-testsuite/concurrent-basic    RUNNING
> [INFO] concurrent-testsuite/concurrent-basic    SUCCESS (0:06:07.833) 
> [INFO] console-testsuite/advanced               RUNNING
> [INFO] console-testsuite/advanced               FAILURE (0:00:49.084) Java returned:
1
> [INFO] console-testsuite/basic                  RUNNING
> [INFO] console-testsuite/basic                  SUCCESS (0:01:54.322) 
> [INFO] corba-testsuite/corba-helloworld         RUNNING
> [INFO] corba-testsuite/corba-helloworld         SUCCESS (0:00:43.577) 
> [INFO] corba-testsuite/corba-marshal            RUNNING
> [INFO] corba-testsuite/corba-marshal            SUCCESS (0:00:45.784) 
> [INFO] corba-testsuite/corba-mytime             RUNNING
> [INFO] corba-testsuite/corba-mytime             SUCCESS (0:00:46.110) 
> [INFO] deployment-testsuite/deployment-tests    RUNNING
> [INFO] deployment-testsuite/deployment-tests    SUCCESS (0:00:31.309) 
> [INFO] deployment-testsuite/jca-cms-tests       RUNNING
> [INFO] deployment-testsuite/jca-cms-tests       SUCCESS (0:00:28.424) 
> [INFO] deployment-testsuite/manifestcp-tests    RUNNING
> [INFO] deployment-testsuite/manifestcp-tests    SUCCESS (0:00:29.709) 
> [INFO] enterprise-testsuite/ejb-tests           RUNNING
> [INFO] enterprise-testsuite/ejb-tests           SUCCESS (0:00:34.826) 
> [INFO] enterprise-testsuite/jms-tests           RUNNING
> [INFO] enterprise-testsuite/jms-tests           SUCCESS (0:00:46.545) 
> [INFO] enterprise-testsuite/jpa-tests           RUNNING
> [INFO] enterprise-testsuite/jpa-tests           SUCCESS (0:00:38.125) 
> [INFO] enterprise-testsuite/sec-client          RUNNING
> [INFO] enterprise-testsuite/sec-client          SUCCESS (0:00:27.500) 
> [INFO] enterprise-testsuite/sec-tests           RUNNING
> [INFO] enterprise-testsuite/sec-tests           SUCCESS (0:00:49.376) 
> [INFO] security-testsuite/test-security         RUNNING
> [INFO] security-testsuite/test-security         SUCCESS (0:00:40.423) 
> [INFO] web-testsuite/test-2.1-jsps              RUNNING
> [INFO] web-testsuite/test-2.1-jsps              SUCCESS (0:00:35.687) 
> [INFO] web-testsuite/test-2.5-servlets          RUNNING
> [INFO] web-testsuite/test-2.5-servlets          SUCCESS (0:00:27.532) 
> [INFO] web-testsuite/test-jetty                 RUNNING
> [INFO] web-testsuite/test-jetty                 SUCCESS (0:00:20.677) 
> [INFO] web-testsuite/test-myfaces               RUNNING
> [INFO] web-testsuite/test-myfaces               SUCCESS (0:00:33.274) 
> [INFO] web-testsuite/test-web-forward           RUNNING
> [INFO] web-testsuite/test-web-forward           SUCCESS (0:00:31.939) 
> [INFO] web-testsuite/test-web-references        RUNNING
> [INFO] web-testsuite/test-web-references        SUCCESS (0:00:38.560) 
> [INFO] webservices-testsuite/jaxb-tests         RUNNING
> [INFO] webservices-testsuite/jaxb-tests         SUCCESS (0:00:51.668) 
> [INFO] webservices-testsuite/jaxr-tests         RUNNING
> [INFO] webservices-testsuite/jaxr-tests         SUCCESS (0:00:51.903) 
> [INFO] webservices-testsuite/jaxrpc-jaxws-tests RUNNING
> [INFO] webservices-testsuite/jaxrpc-jaxws-tests SUCCESS (0:00:29.142) 
> [INFO] webservices-testsuite/jaxrpc-tests       RUNNING
> [INFO] webservices-testsuite/jaxrpc-tests       SUCCESS (0:00:39.002) 
> [INFO] webservices-testsuite/jaxws-tests        RUNNING
> [INFO] webservices-testsuite/jaxws-tests        SUCCESS (0:01:26.552) 
> [INFO] webservices-testsuite/saaj-tests         RUNNING
> [INFO] webservices-testsuite/saaj-tests         SUCCESS (0:00:37.763) 
> [INFO] webservices-testsuite/stax-tests         RUNNING
> [INFO] webservices-testsuite/stax-tests         SUCCESS (0:00:52.442) 
> [INFO] 
> [INFO] -------------------------------------------------------------------------------
> [INFO] Test Summary (0:27:41.424)
> [INFO]     Passed: 30
> [INFO]     Failed: 2
> [INFO] -------------------------------------------------------------------------------
> [INFO] 
> [INFO] The following tests failed:
> [INFO]     * commands-testsuite/deploy - /home/geronimo/geronimo/trunk/testsuite/commands-testsuite/deploy/build.log
> [INFO]     * console-testsuite/advanced - /home/geronimo/geronimo/trunk/testsuite/console-testsuite/advanced/build.log
> [INFO] 
> [INFO] ------------------------------------------------------------------------
> [ERROR] BUILD ERROR
>  
> Samples: trunk
> =================================
> Log: http://people.apache.org/builds/geronimo/server/binaries/trunk/20080919/samples-0900.log
>  
> Build status: OK
>  
> 

Mime
View raw message