geronimo-dev mailing list archives

Site index · List index
Message view « Date » · « Thread »
Top « Date » · « Thread »
From ga...@apache.org
Subject [BUILD] trunk: Failed for Revision: 697651
Date Mon, 22 Sep 2008 03:08:25 GMT
Geronimo Revision: 697651 built with tests included
 
See the full build-2100.log file at http://people.apache.org/builds/geronimo/server/binaries/trunk/20080921/build-2100.log
 
Download the binaries from http://people.apache.org/builds/geronimo/server/binaries/trunk/20080921
[INFO] BUILD SUCCESSFUL
[INFO] ------------------------------------------------------------------------
[INFO] Total time: 49 minutes 16 seconds
[INFO] Finished at: Sun Sep 21 21:52:42 EDT 2008
[INFO] Final Memory: 362M/1005M
[INFO] ------------------------------------------------------------------------
 
TESTSUITE RESULTS (Failures only)
=================================
See detailed results at http://people.apache.org/builds/geronimo/server/testsuite/ResultsSummary.html
 
Assembly: tomcat
=================================
See the full test.log file at http://people.apache.org/builds/geronimo/server/binaries/trunk/20080921/logs-2100-tomcat/test.log
 
 
[INFO] Using geronimoHome: /home/geronimo/geronimo/trunk/testsuite/target/geronimo-tomcat6-javaee5-2.2-SNAPSHOT
[INFO] Installing assembly...
[INFO] Expanding: /home/geronimo/.m2/repository/org/apache/geronimo/assemblies/geronimo-tomcat6-javaee5/2.2-SNAPSHOT/geronimo-tomcat6-javaee5-2.2-SNAPSHOT-bin.zip
into /home/geronimo/geronimo/trunk/testsuite/target
[INFO] Starting Geronimo server...
[INFO] Selected option set: default
[INFO] Redirecting output to: /home/geronimo/geronimo/trunk/testsuite/target/geronimo-logs/org.apache.geronimo.mavenplugins.geronimo.server.StartServerMojo.log
[INFO] Waiting for Geronimo server...
[INFO] Geronimo server started in 0:00:43.541
[INFO] [shitty:install {execution: default}]
[INFO] Installing /home/geronimo/geronimo/trunk/testsuite/pom.xml to /home/geronimo/.m2/repository/org/apache/geronimo/testsuite/testsuite/2.2-SNAPSHOT/testsuite-2.2-SNAPSHOT.pom
[INFO] [shitty:test {execution: default}]
[INFO] Starting 32 test build(s)
[INFO] 
[INFO] -------------------------------------------------------------------------------
[INFO] 
[INFO] commands-testsuite/deploy                RUNNING
[INFO] commands-testsuite/deploy                SUCCESS (0:01:16.524) 
[INFO] commands-testsuite/gshell                RUNNING
[INFO] commands-testsuite/gshell                SUCCESS (0:00:30.315) 
[INFO] commands-testsuite/jaxws                 RUNNING
[INFO] commands-testsuite/jaxws                 SUCCESS (0:00:19.884) 
[INFO] commands-testsuite/shutdown              RUNNING
[INFO] commands-testsuite/shutdown              SUCCESS (0:00:16.959) 
[INFO] concurrent-testsuite/concurrent-basic    RUNNING
[INFO] concurrent-testsuite/concurrent-basic    SUCCESS (0:06:12.696) 
[INFO] console-testsuite/advanced               RUNNING
[INFO] console-testsuite/advanced               FAILURE (0:00:51.645) Java returned: 1
[INFO] console-testsuite/basic                  RUNNING
[INFO] console-testsuite/basic                  SUCCESS (0:01:46.182) 
[INFO] corba-testsuite/corba-helloworld         RUNNING
[INFO] corba-testsuite/corba-helloworld         FAILURE (0:00:29.790) Java returned: 1
[INFO] corba-testsuite/corba-marshal            RUNNING
[INFO] corba-testsuite/corba-marshal            FAILURE (0:00:26.058) Java returned: 1
[INFO] corba-testsuite/corba-mytime             RUNNING
[INFO] corba-testsuite/corba-mytime             FAILURE (0:00:32.309) Java returned: 1
[INFO] deployment-testsuite/deployment-tests    RUNNING
[INFO] deployment-testsuite/deployment-tests    SUCCESS (0:00:31.027) 
[INFO] deployment-testsuite/jca-cms-tests       RUNNING
[INFO] deployment-testsuite/jca-cms-tests       SUCCESS (0:00:27.392) 
[INFO] deployment-testsuite/manifestcp-tests    RUNNING
[INFO] deployment-testsuite/manifestcp-tests    SUCCESS (0:00:28.888) 
[INFO] enterprise-testsuite/ejb-tests           RUNNING
[INFO] enterprise-testsuite/ejb-tests           SUCCESS (0:00:41.253) 
[INFO] enterprise-testsuite/jms-tests           RUNNING
[INFO] enterprise-testsuite/jms-tests           SUCCESS (0:00:48.077) 
[INFO] enterprise-testsuite/jpa-tests           RUNNING
[INFO] enterprise-testsuite/jpa-tests           SUCCESS (0:00:49.959) 
[INFO] enterprise-testsuite/sec-client          RUNNING
[INFO] enterprise-testsuite/sec-client          FAILURE (0:00:14.820) Java returned: 1
[INFO] enterprise-testsuite/sec-tests           RUNNING
[INFO] enterprise-testsuite/sec-tests           FAILURE (0:00:27.399) Java returned: 1
[INFO] security-testsuite/test-security         RUNNING
[INFO] security-testsuite/test-security         SUCCESS (0:00:39.565) 
[INFO] web-testsuite/test-2.1-jsps              RUNNING
[INFO] web-testsuite/test-2.1-jsps              SUCCESS (0:00:36.842) 
[INFO] web-testsuite/test-2.5-servlets          RUNNING
[INFO] web-testsuite/test-2.5-servlets          SUCCESS (0:00:26.156) 
[INFO] web-testsuite/test-myfaces               RUNNING
[INFO] web-testsuite/test-myfaces               SUCCESS (0:00:33.833) 
[INFO] web-testsuite/test-tomcat                RUNNING
[INFO] web-testsuite/test-tomcat                SUCCESS (0:00:19.909) 
[INFO] web-testsuite/test-web-forward           RUNNING
[INFO] web-testsuite/test-web-forward           SUCCESS (0:00:31.153) 
[INFO] web-testsuite/test-web-references        RUNNING
[INFO] web-testsuite/test-web-references        SUCCESS (0:00:36.417) 
[INFO] webservices-testsuite/jaxb-tests         RUNNING
[INFO] webservices-testsuite/jaxb-tests         FAILURE (0:00:41.927) Java returned: 1
[INFO] webservices-testsuite/jaxr-tests         RUNNING
[INFO] webservices-testsuite/jaxr-tests         FAILURE (0:00:42.553) Java returned: 1
[INFO] webservices-testsuite/jaxrpc-jaxws-tests RUNNING
[INFO] webservices-testsuite/jaxrpc-jaxws-tests SUCCESS (0:00:30.685) 
[INFO] webservices-testsuite/jaxrpc-tests       RUNNING
[INFO] webservices-testsuite/jaxrpc-tests       SUCCESS (0:00:38.168) 
[INFO] webservices-testsuite/jaxws-tests        RUNNING
[INFO] webservices-testsuite/jaxws-tests        FAILURE (0:00:41.760) Java returned: 1
[INFO] webservices-testsuite/saaj-tests         RUNNING
[INFO] webservices-testsuite/saaj-tests         FAILURE (0:00:28.810) Java returned: 1
[INFO] webservices-testsuite/stax-tests         RUNNING
[INFO] webservices-testsuite/stax-tests         FAILURE (0:00:42.315) Java returned: 1
[INFO] 
[INFO] -------------------------------------------------------------------------------
[INFO] Test Summary (0:25:21.467)
[INFO]     Passed: 21
[INFO]     Failed: 11
[INFO] -------------------------------------------------------------------------------
[INFO] 
[INFO] The following tests failed:
[INFO]     * console-testsuite/advanced - /home/geronimo/geronimo/trunk/testsuite/console-testsuite/advanced/build.log
[INFO]     * corba-testsuite/corba-helloworld - /home/geronimo/geronimo/trunk/testsuite/corba-testsuite/corba-helloworld/build.log
[INFO]     * corba-testsuite/corba-marshal - /home/geronimo/geronimo/trunk/testsuite/corba-testsuite/corba-marshal/build.log
[INFO]     * corba-testsuite/corba-mytime - /home/geronimo/geronimo/trunk/testsuite/corba-testsuite/corba-mytime/build.log
[INFO]     * enterprise-testsuite/sec-client - /home/geronimo/geronimo/trunk/testsuite/enterprise-testsuite/sec-client/build.log
[INFO]     * enterprise-testsuite/sec-tests - /home/geronimo/geronimo/trunk/testsuite/enterprise-testsuite/sec-tests/build.log
[INFO]     * webservices-testsuite/jaxb-tests - /home/geronimo/geronimo/trunk/testsuite/webservices-testsuite/jaxb-tests/build.log
[INFO]     * webservices-testsuite/jaxr-tests - /home/geronimo/geronimo/trunk/testsuite/webservices-testsuite/jaxr-tests/build.log
[INFO]     * webservices-testsuite/jaxws-tests - /home/geronimo/geronimo/trunk/testsuite/webservices-testsuite/jaxws-tests/build.log
[INFO]     * webservices-testsuite/saaj-tests - /home/geronimo/geronimo/trunk/testsuite/webservices-testsuite/saaj-tests/build.log
[INFO]     * webservices-testsuite/stax-tests - /home/geronimo/geronimo/trunk/testsuite/webservices-testsuite/stax-tests/build.log
[INFO] 
[INFO] ------------------------------------------------------------------------
[ERROR] BUILD ERROR
 
Assembly: jetty
=================================
See the full test.log file at http://people.apache.org/builds/geronimo/server/binaries/trunk/20080921/logs-2100-jetty/test.log
 
 
[INFO] Using geronimoHome: /home/geronimo/geronimo/trunk/testsuite/target/geronimo-jetty6-javaee5-2.2-SNAPSHOT
[INFO] Installing assembly...
[INFO] Expanding: /home/geronimo/.m2/repository/org/apache/geronimo/assemblies/geronimo-jetty6-javaee5/2.2-SNAPSHOT/geronimo-jetty6-javaee5-2.2-SNAPSHOT-bin.zip
into /home/geronimo/geronimo/trunk/testsuite/target
[INFO] Starting Geronimo server...
[INFO] Selected option set: default
[INFO] Redirecting output to: /home/geronimo/geronimo/trunk/testsuite/target/geronimo-logs/org.apache.geronimo.mavenplugins.geronimo.server.StartServerMojo.log
[INFO] Waiting for Geronimo server...
[INFO] Geronimo server started in 0:00:41.304
[INFO] [shitty:install {execution: default}]
[INFO] Installing /home/geronimo/geronimo/trunk/testsuite/pom.xml to /home/geronimo/.m2/repository/org/apache/geronimo/testsuite/testsuite/2.2-SNAPSHOT/testsuite-2.2-SNAPSHOT.pom
[INFO] [shitty:test {execution: default}]
[INFO] Starting 32 test build(s)
[INFO] 
[INFO] -------------------------------------------------------------------------------
[INFO] 
[INFO] commands-testsuite/deploy                RUNNING
[INFO] commands-testsuite/deploy                SUCCESS (0:01:07.992) 
[INFO] commands-testsuite/gshell                RUNNING
[INFO] commands-testsuite/gshell                SUCCESS (0:00:30.147) 
[INFO] commands-testsuite/jaxws                 RUNNING
[INFO] commands-testsuite/jaxws                 SUCCESS (0:00:18.650) 
[INFO] commands-testsuite/shutdown              RUNNING
[INFO] commands-testsuite/shutdown              SUCCESS (0:00:16.374) 
[INFO] concurrent-testsuite/concurrent-basic    RUNNING
[INFO] concurrent-testsuite/concurrent-basic    SUCCESS (0:06:08.913) 
[INFO] console-testsuite/advanced               RUNNING
[INFO] console-testsuite/advanced               FAILURE (0:00:48.179) Java returned: 1
[INFO] console-testsuite/basic                  RUNNING
[INFO] console-testsuite/basic                  SUCCESS (0:01:53.641) 
[INFO] corba-testsuite/corba-helloworld         RUNNING
[INFO] corba-testsuite/corba-helloworld         FAILURE (0:00:29.221) Java returned: 1
[INFO] corba-testsuite/corba-marshal            RUNNING
[INFO] corba-testsuite/corba-marshal            FAILURE (0:00:26.061) Java returned: 1
[INFO] corba-testsuite/corba-mytime             RUNNING
[INFO] corba-testsuite/corba-mytime             FAILURE (0:00:32.419) Java returned: 1
[INFO] deployment-testsuite/deployment-tests    RUNNING
[INFO] deployment-testsuite/deployment-tests    SUCCESS (0:00:31.848) 
[INFO] deployment-testsuite/jca-cms-tests       RUNNING
[INFO] deployment-testsuite/jca-cms-tests       SUCCESS (0:00:27.816) 
[INFO] deployment-testsuite/manifestcp-tests    RUNNING
[INFO] deployment-testsuite/manifestcp-tests    SUCCESS (0:00:31.159) 
[INFO] enterprise-testsuite/ejb-tests           RUNNING
[INFO] enterprise-testsuite/ejb-tests           SUCCESS (0:00:34.662) 
[INFO] enterprise-testsuite/jms-tests           RUNNING
[INFO] enterprise-testsuite/jms-tests           SUCCESS (0:00:46.802) 
[INFO] enterprise-testsuite/jpa-tests           RUNNING
[INFO] enterprise-testsuite/jpa-tests           SUCCESS (0:00:38.400) 
[INFO] enterprise-testsuite/sec-client          RUNNING
[INFO] enterprise-testsuite/sec-client          FAILURE (0:00:14.517) Java returned: 1
[INFO] enterprise-testsuite/sec-tests           RUNNING
[INFO] enterprise-testsuite/sec-tests           FAILURE (0:00:24.754) Java returned: 1
[INFO] security-testsuite/test-security         RUNNING
[INFO] security-testsuite/test-security         SUCCESS (0:00:40.520) 
[INFO] web-testsuite/test-2.1-jsps              RUNNING
[INFO] web-testsuite/test-2.1-jsps              SUCCESS (0:00:38.193) 
[INFO] web-testsuite/test-2.5-servlets          RUNNING
[INFO] web-testsuite/test-2.5-servlets          SUCCESS (0:00:26.874) 
[INFO] web-testsuite/test-jetty                 RUNNING
[INFO] web-testsuite/test-jetty                 SUCCESS (0:00:20.013) 
[INFO] web-testsuite/test-myfaces               RUNNING
[INFO] web-testsuite/test-myfaces               SUCCESS (0:00:33.435) 
[INFO] web-testsuite/test-web-forward           RUNNING
[INFO] web-testsuite/test-web-forward           SUCCESS (0:00:30.784) 
[INFO] web-testsuite/test-web-references        RUNNING
[INFO] web-testsuite/test-web-references        SUCCESS (0:00:38.377) 
[INFO] webservices-testsuite/jaxb-tests         RUNNING
[INFO] webservices-testsuite/jaxb-tests         FAILURE (0:00:43.791) Java returned: 1
[INFO] webservices-testsuite/jaxr-tests         RUNNING
[INFO] webservices-testsuite/jaxr-tests         FAILURE (0:00:42.251) Java returned: 1
[INFO] webservices-testsuite/jaxrpc-jaxws-tests RUNNING
[INFO] webservices-testsuite/jaxrpc-jaxws-tests SUCCESS (0:00:28.319) 
[INFO] webservices-testsuite/jaxrpc-tests       RUNNING
[INFO] webservices-testsuite/jaxrpc-tests       SUCCESS (0:00:39.736) 
[INFO] webservices-testsuite/jaxws-tests        RUNNING
[INFO] webservices-testsuite/jaxws-tests        FAILURE (0:00:38.007) Java returned: 1
[INFO] webservices-testsuite/saaj-tests         RUNNING
[INFO] webservices-testsuite/saaj-tests         FAILURE (0:00:29.285) Java returned: 1
[INFO] webservices-testsuite/stax-tests         RUNNING
[INFO] webservices-testsuite/stax-tests         FAILURE (0:00:44.774) Java returned: 1
[INFO] 
[INFO] -------------------------------------------------------------------------------
[INFO] Test Summary (0:24:56.143)
[INFO]     Passed: 21
[INFO]     Failed: 11
[INFO] -------------------------------------------------------------------------------
[INFO] 
[INFO] The following tests failed:
[INFO]     * console-testsuite/advanced - /home/geronimo/geronimo/trunk/testsuite/console-testsuite/advanced/build.log
[INFO]     * corba-testsuite/corba-helloworld - /home/geronimo/geronimo/trunk/testsuite/corba-testsuite/corba-helloworld/build.log
[INFO]     * corba-testsuite/corba-marshal - /home/geronimo/geronimo/trunk/testsuite/corba-testsuite/corba-marshal/build.log
[INFO]     * corba-testsuite/corba-mytime - /home/geronimo/geronimo/trunk/testsuite/corba-testsuite/corba-mytime/build.log
[INFO]     * enterprise-testsuite/sec-client - /home/geronimo/geronimo/trunk/testsuite/enterprise-testsuite/sec-client/build.log
[INFO]     * enterprise-testsuite/sec-tests - /home/geronimo/geronimo/trunk/testsuite/enterprise-testsuite/sec-tests/build.log
[INFO]     * webservices-testsuite/jaxb-tests - /home/geronimo/geronimo/trunk/testsuite/webservices-testsuite/jaxb-tests/build.log
[INFO]     * webservices-testsuite/jaxr-tests - /home/geronimo/geronimo/trunk/testsuite/webservices-testsuite/jaxr-tests/build.log
[INFO]     * webservices-testsuite/jaxws-tests - /home/geronimo/geronimo/trunk/testsuite/webservices-testsuite/jaxws-tests/build.log
[INFO]     * webservices-testsuite/saaj-tests - /home/geronimo/geronimo/trunk/testsuite/webservices-testsuite/saaj-tests/build.log
[INFO]     * webservices-testsuite/stax-tests - /home/geronimo/geronimo/trunk/testsuite/webservices-testsuite/stax-tests/build.log
[INFO] 
[INFO] ------------------------------------------------------------------------
[ERROR] BUILD ERROR
 
Samples: trunk
=================================
Log: http://people.apache.org/builds/geronimo/server/binaries/trunk/20080921/samples-2100.log
 
Build status: OK
 

Mime
View raw message