geronimo-dev mailing list archives

Site index · List index
Message view « Date » · « Thread »
Top « Date » · « Thread »
From ga...@apache.org
Subject [BUILD] trunk: Failed for Revision: 696121
Date Wed, 17 Sep 2008 03:07:14 GMT
Geronimo Revision: 696121 built with tests included
 
See the full build-2100.log file at http://people.apache.org/builds/geronimo/server/binaries/trunk/20080916/build-2100.log
 
Download the binaries from http://people.apache.org/builds/geronimo/server/binaries/trunk/20080916
[INFO] BUILD SUCCESSFUL
[INFO] ------------------------------------------------------------------------
[INFO] Total time: 37 minutes 48 seconds
[INFO] Finished at: Tue Sep 16 21:44:37 EDT 2008
[INFO] Final Memory: 376M/1014M
[INFO] ------------------------------------------------------------------------
 
TESTSUITE RESULTS (Failures only)
=================================
See detailed results at http://people.apache.org/builds/geronimo/server/testsuite/ResultsSummary.html
 
Assembly: tomcat
=================================
See the full test.log file at http://people.apache.org/builds/geronimo/server/binaries/trunk/20080916/logs-2100-tomcat/test.log
 
 
[INFO] Redirecting output to: /home/geronimo/geronimo/trunk/testsuite/target/selenium/server.log
[INFO] User extensions: /home/geronimo/geronimo/trunk/testsuite/target/selenium/user-extensions.js
Selenium Server started
[INFO] [geronimo:start-server {execution: start}]
[INFO] Using assembly configuration: tomcat
[INFO] snapshot org.apache.geronimo.assemblies:geronimo-tomcat6-javaee5:2.2-SNAPSHOT: checking
for updates from apache-snapshots
[INFO] snapshot org.apache.geronimo.assemblies:geronimo-tomcat6-javaee5:2.2-SNAPSHOT: checking
for updates from codehaus-snapshots
[INFO] snapshot org.apache.geronimo.assemblies:geronimo-tomcat6-javaee5:2.2-SNAPSHOT: checking
for updates from apache.snapshots
[INFO] Using assembly artifact: org.apache.geronimo.assemblies:geronimo-tomcat6-javaee5:zip:bin:2.2-SNAPSHOT:provided
[INFO] Using geronimoHome: /home/geronimo/geronimo/trunk/testsuite/target/geronimo-tomcat6-javaee5-2.2-SNAPSHOT
[INFO] Installing assembly...
[INFO] Expanding: /home/geronimo/.m2/repository/org/apache/geronimo/assemblies/geronimo-tomcat6-javaee5/2.2-SNAPSHOT/geronimo-tomcat6-javaee5-2.2-SNAPSHOT-bin.zip
into /home/geronimo/geronimo/trunk/testsuite/target
[INFO] Starting Geronimo server...
[INFO] Selected option set: default
[INFO] Redirecting output to: /home/geronimo/geronimo/trunk/testsuite/target/geronimo-logs/org.apache.geronimo.mavenplugins.geronimo.server.StartServerMojo.log
[INFO] Waiting for Geronimo server...
[INFO] Geronimo server started in 0:00:40.415
[INFO] [shitty:install {execution: default}]
[INFO] Installing /home/geronimo/geronimo/trunk/testsuite/pom.xml to /home/geronimo/.m2/repository/org/apache/geronimo/testsuite/testsuite/2.2-SNAPSHOT/testsuite-2.2-SNAPSHOT.pom
[INFO] [shitty:test {execution: default}]
[INFO] Starting 32 test build(s)
[INFO] 
[INFO] -------------------------------------------------------------------------------
[INFO] 
[INFO] commands-testsuite/deploy                RUNNING
[INFO] commands-testsuite/deploy                FAILURE (0:01:12.577) Java returned: 1
[INFO] commands-testsuite/gshell                RUNNING
[INFO] commands-testsuite/gshell                SUCCESS (0:00:29.674) 
[INFO] commands-testsuite/jaxws                 RUNNING
[INFO] commands-testsuite/jaxws                 SUCCESS (0:00:19.758) 
[INFO] commands-testsuite/shutdown              RUNNING
[INFO] commands-testsuite/shutdown              SUCCESS (0:00:16.990) 
[INFO] concurrent-testsuite/concurrent-basic    RUNNING
[INFO] concurrent-testsuite/concurrent-basic    SUCCESS (0:06:18.684) 
[INFO] console-testsuite/advanced               RUNNING
[INFO] console-testsuite/advanced               FAILURE (0:00:49.908) Java returned: 1
[INFO] console-testsuite/basic                  RUNNING
[INFO] console-testsuite/basic                  SUCCESS (0:01:45.318) 
[INFO] corba-testsuite/corba-helloworld         RUNNING
[INFO] corba-testsuite/corba-helloworld         SUCCESS (0:00:42.481) 
[INFO] corba-testsuite/corba-marshal            RUNNING
[INFO] corba-testsuite/corba-marshal            SUCCESS (0:01:02.483) 
[INFO] corba-testsuite/corba-mytime             RUNNING
[INFO] corba-testsuite/corba-mytime             SUCCESS (0:00:44.194) 
[INFO] deployment-testsuite/deployment-tests    RUNNING
[INFO] deployment-testsuite/deployment-tests    SUCCESS (0:00:40.617) 
[INFO] deployment-testsuite/jca-cms-tests       RUNNING
[INFO] deployment-testsuite/jca-cms-tests       SUCCESS (0:00:27.120) 
[INFO] deployment-testsuite/manifestcp-tests    RUNNING
[INFO] deployment-testsuite/manifestcp-tests    SUCCESS (0:00:28.968) 
[INFO] enterprise-testsuite/ejb-tests           RUNNING
[INFO] enterprise-testsuite/ejb-tests           SUCCESS (0:00:42.248) 
[INFO] enterprise-testsuite/jms-tests           RUNNING
[INFO] enterprise-testsuite/jms-tests           SUCCESS (0:00:47.182) 
[INFO] enterprise-testsuite/jpa-tests           RUNNING
[INFO] enterprise-testsuite/jpa-tests           SUCCESS (0:00:50.869) 
[INFO] enterprise-testsuite/sec-client          RUNNING
[INFO] enterprise-testsuite/sec-client          SUCCESS (0:00:27.024) 
[INFO] enterprise-testsuite/sec-tests           RUNNING
[INFO] enterprise-testsuite/sec-tests           SUCCESS (0:00:48.933) 
[INFO] security-testsuite/test-security         RUNNING
[INFO] security-testsuite/test-security         SUCCESS (0:00:40.457) 
[INFO] web-testsuite/test-2.1-jsps              RUNNING
[INFO] web-testsuite/test-2.1-jsps              SUCCESS (0:00:36.159) 
[INFO] web-testsuite/test-2.5-servlets          RUNNING
[INFO] web-testsuite/test-2.5-servlets          SUCCESS (0:00:25.984) 
[INFO] web-testsuite/test-myfaces               RUNNING
[INFO] web-testsuite/test-myfaces               SUCCESS (0:00:32.587) 
[INFO] web-testsuite/test-tomcat                RUNNING
[INFO] web-testsuite/test-tomcat                SUCCESS (0:00:19.135) 
[INFO] web-testsuite/test-web-forward           RUNNING
[INFO] web-testsuite/test-web-forward           SUCCESS (0:00:30.956) 
[INFO] web-testsuite/test-web-references        RUNNING
[INFO] web-testsuite/test-web-references        SUCCESS (0:00:37.100) 
[INFO] webservices-testsuite/jaxb-tests         RUNNING
[INFO] webservices-testsuite/jaxb-tests         SUCCESS (0:00:52.197) 
[INFO] webservices-testsuite/jaxr-tests         RUNNING
[INFO] webservices-testsuite/jaxr-tests         SUCCESS (0:00:49.415) 
[INFO] webservices-testsuite/jaxrpc-jaxws-tests RUNNING
[INFO] webservices-testsuite/jaxrpc-jaxws-tests SUCCESS (0:00:30.083) 
[INFO] webservices-testsuite/jaxrpc-tests       RUNNING
[INFO] webservices-testsuite/jaxrpc-tests       SUCCESS (0:00:37.592) 
[INFO] webservices-testsuite/jaxws-tests        RUNNING
[INFO] webservices-testsuite/jaxws-tests        SUCCESS (0:01:35.037) 
[INFO] webservices-testsuite/saaj-tests         RUNNING
[INFO] webservices-testsuite/saaj-tests         SUCCESS (0:00:37.469) 
[INFO] webservices-testsuite/stax-tests         RUNNING
[INFO] webservices-testsuite/stax-tests         SUCCESS (0:00:51.288) 
[INFO] 
[INFO] -------------------------------------------------------------------------------
[INFO] Test Summary (0:28:30.666)
[INFO]     Passed: 30
[INFO]     Failed: 2
[INFO] -------------------------------------------------------------------------------
[INFO] 
[INFO] The following tests failed:
[INFO]     * commands-testsuite/deploy - /home/geronimo/geronimo/trunk/testsuite/commands-testsuite/deploy/build.log
[INFO]     * console-testsuite/advanced - /home/geronimo/geronimo/trunk/testsuite/console-testsuite/advanced/build.log
[INFO] 
[INFO] ------------------------------------------------------------------------
[ERROR] BUILD ERROR
 
Assembly: jetty
=================================
See the full test.log file at http://people.apache.org/builds/geronimo/server/binaries/trunk/20080916/logs-2100-jetty/test.log
 
 
[INFO] Redirecting output to: /home/geronimo/geronimo/trunk/testsuite/target/selenium/server.log
[INFO] User extensions: /home/geronimo/geronimo/trunk/testsuite/target/selenium/user-extensions.js
Selenium Server started
[INFO] [geronimo:start-server {execution: start}]
[INFO] Using assembly configuration: jetty
[INFO] snapshot org.apache.geronimo.assemblies:geronimo-jetty6-javaee5:2.2-SNAPSHOT: checking
for updates from apache-snapshots
[INFO] snapshot org.apache.geronimo.assemblies:geronimo-jetty6-javaee5:2.2-SNAPSHOT: checking
for updates from codehaus-snapshots
[INFO] snapshot org.apache.geronimo.assemblies:geronimo-jetty6-javaee5:2.2-SNAPSHOT: checking
for updates from apache.snapshots
[INFO] Using assembly artifact: org.apache.geronimo.assemblies:geronimo-jetty6-javaee5:zip:bin:2.2-SNAPSHOT:provided
[INFO] Using geronimoHome: /home/geronimo/geronimo/trunk/testsuite/target/geronimo-jetty6-javaee5-2.2-SNAPSHOT
[INFO] Installing assembly...
[INFO] Expanding: /home/geronimo/.m2/repository/org/apache/geronimo/assemblies/geronimo-jetty6-javaee5/2.2-SNAPSHOT/geronimo-jetty6-javaee5-2.2-SNAPSHOT-bin.zip
into /home/geronimo/geronimo/trunk/testsuite/target
[INFO] Starting Geronimo server...
[INFO] Selected option set: default
[INFO] Redirecting output to: /home/geronimo/geronimo/trunk/testsuite/target/geronimo-logs/org.apache.geronimo.mavenplugins.geronimo.server.StartServerMojo.log
[INFO] Waiting for Geronimo server...
[INFO] Geronimo server started in 0:00:42.324
[INFO] [shitty:install {execution: default}]
[INFO] Installing /home/geronimo/geronimo/trunk/testsuite/pom.xml to /home/geronimo/.m2/repository/org/apache/geronimo/testsuite/testsuite/2.2-SNAPSHOT/testsuite-2.2-SNAPSHOT.pom
[INFO] [shitty:test {execution: default}]
[INFO] Starting 32 test build(s)
[INFO] 
[INFO] -------------------------------------------------------------------------------
[INFO] 
[INFO] commands-testsuite/deploy                RUNNING
[INFO] commands-testsuite/deploy                FAILURE (0:01:04.749) Java returned: 1
[INFO] commands-testsuite/gshell                RUNNING
[INFO] commands-testsuite/gshell                SUCCESS (0:00:30.807) 
[INFO] commands-testsuite/jaxws                 RUNNING
[INFO] commands-testsuite/jaxws                 SUCCESS (0:00:19.154) 
[INFO] commands-testsuite/shutdown              RUNNING
[INFO] commands-testsuite/shutdown              SUCCESS (0:00:16.482) 
[INFO] concurrent-testsuite/concurrent-basic    RUNNING
[INFO] concurrent-testsuite/concurrent-basic    SUCCESS (0:06:07.375) 
[INFO] console-testsuite/advanced               RUNNING
[INFO] console-testsuite/advanced               FAILURE (0:00:49.428) Java returned: 1
[INFO] console-testsuite/basic                  RUNNING
[INFO] console-testsuite/basic                  SUCCESS (0:01:53.074) 
[INFO] corba-testsuite/corba-helloworld         RUNNING
[INFO] corba-testsuite/corba-helloworld         SUCCESS (0:00:44.288) 
[INFO] corba-testsuite/corba-marshal            RUNNING
[INFO] corba-testsuite/corba-marshal            SUCCESS (0:00:58.044) 
[INFO] corba-testsuite/corba-mytime             RUNNING
[INFO] corba-testsuite/corba-mytime             SUCCESS (0:00:43.930) 
[INFO] deployment-testsuite/deployment-tests    RUNNING
[INFO] deployment-testsuite/deployment-tests    SUCCESS (0:00:32.157) 
[INFO] deployment-testsuite/jca-cms-tests       RUNNING
[INFO] deployment-testsuite/jca-cms-tests       SUCCESS (0:00:28.069) 
[INFO] deployment-testsuite/manifestcp-tests    RUNNING
[INFO] deployment-testsuite/manifestcp-tests    SUCCESS (0:00:31.230) 
[INFO] enterprise-testsuite/ejb-tests           RUNNING
[INFO] enterprise-testsuite/ejb-tests           SUCCESS (0:00:34.910) 
[INFO] enterprise-testsuite/jms-tests           RUNNING
[INFO] enterprise-testsuite/jms-tests           SUCCESS (0:00:47.560) 
[INFO] enterprise-testsuite/jpa-tests           RUNNING
[INFO] enterprise-testsuite/jpa-tests           SUCCESS (0:00:39.055) 
[INFO] enterprise-testsuite/sec-client          RUNNING
[INFO] enterprise-testsuite/sec-client          SUCCESS (0:00:26.901) 
[INFO] enterprise-testsuite/sec-tests           RUNNING
[INFO] enterprise-testsuite/sec-tests           SUCCESS (0:00:49.440) 
[INFO] security-testsuite/test-security         RUNNING
[INFO] security-testsuite/test-security         SUCCESS (0:00:40.047) 
[INFO] web-testsuite/test-2.1-jsps              RUNNING
[INFO] web-testsuite/test-2.1-jsps              SUCCESS (0:00:35.598) 
[INFO] web-testsuite/test-2.5-servlets          RUNNING
[INFO] web-testsuite/test-2.5-servlets          SUCCESS (0:00:26.812) 
[INFO] web-testsuite/test-jetty                 RUNNING
[INFO] web-testsuite/test-jetty                 SUCCESS (0:00:20.289) 
[INFO] web-testsuite/test-myfaces               RUNNING
[INFO] web-testsuite/test-myfaces               SUCCESS (0:00:32.886) 
[INFO] web-testsuite/test-web-forward           RUNNING
[INFO] web-testsuite/test-web-forward           SUCCESS (0:00:30.729) 
[INFO] web-testsuite/test-web-references        RUNNING
[INFO] web-testsuite/test-web-references        SUCCESS (0:00:37.139) 
[INFO] webservices-testsuite/jaxb-tests         RUNNING
[INFO] webservices-testsuite/jaxb-tests         SUCCESS (0:00:52.806) 
[INFO] webservices-testsuite/jaxr-tests         RUNNING
[INFO] webservices-testsuite/jaxr-tests         SUCCESS (0:00:51.909) 
[INFO] webservices-testsuite/jaxrpc-jaxws-tests RUNNING
[INFO] webservices-testsuite/jaxrpc-jaxws-tests SUCCESS (0:00:29.552) 
[INFO] webservices-testsuite/jaxrpc-tests       RUNNING
[INFO] webservices-testsuite/jaxrpc-tests       SUCCESS (0:00:39.607) 
[INFO] webservices-testsuite/jaxws-tests        RUNNING
[INFO] webservices-testsuite/jaxws-tests        SUCCESS (0:01:25.617) 
[INFO] webservices-testsuite/saaj-tests         RUNNING
[INFO] webservices-testsuite/saaj-tests         SUCCESS (0:00:38.356) 
[INFO] webservices-testsuite/stax-tests         RUNNING
[INFO] webservices-testsuite/stax-tests         SUCCESS (0:00:51.802) 
[INFO] 
[INFO] -------------------------------------------------------------------------------
[INFO] Test Summary (0:27:50.015)
[INFO]     Passed: 30
[INFO]     Failed: 2
[INFO] -------------------------------------------------------------------------------
[INFO] 
[INFO] The following tests failed:
[INFO]     * commands-testsuite/deploy - /home/geronimo/geronimo/trunk/testsuite/commands-testsuite/deploy/build.log
[INFO]     * console-testsuite/advanced - /home/geronimo/geronimo/trunk/testsuite/console-testsuite/advanced/build.log
[INFO] 
[INFO] ------------------------------------------------------------------------
[ERROR] BUILD ERROR
 
Samples: trunk
=================================
Log: http://people.apache.org/builds/geronimo/server/binaries/trunk/20080916/samples-2100.log
 
Build status: OK
 

Mime
View raw message