geronimo-dev mailing list archives

Site index · List index
Message view « Date » · « Thread »
Top « Date » · « Thread »
From ga...@apache.org
Subject [BUILD] branches/2.1: Failed for Revision: 695556
Date Mon, 15 Sep 2008 17:54:15 GMT
Geronimo Revision: 695556 built with tests included
 
See the full build-1400.log file at http://people.apache.org/builds/geronimo/server/binaries/2.1/20080915/build-1400.log
 
 
See the unit test reports at http://people.apache.org/builds/geronimo/server/binaries/2.1/20080915/unit-test-reports
 
Downloading: http://download.java.net/maven/1//org.apache.openjpa/poms/openjpa-1.2.0.pom
Downloading: http://people.apache.org/repo/m2-incubating-repository//org/apache/openjpa/openjpa/1.2.0/openjpa-1.2.0.pom
Downloading: http://repo1.maven.org/maven2/org/apache/openjpa/openjpa/1.2.0/openjpa-1.2.0.pom
7K downloaded
Downloading: http://download.java.net/maven/1//org.apache.openjpa/poms/openjpa-parent-1.2.0.pom
Downloading: http://people.apache.org/repo/m2-incubating-repository//org/apache/openjpa/openjpa-parent/1.2.0/openjpa-parent-1.2.0.pom
Downloading: http://repo1.maven.org/maven2/org/apache/openjpa/openjpa-parent/1.2.0/openjpa-parent-1.2.0.pom
25K downloaded
Downloading: http://download.java.net/maven/1//net.sourceforge.serp/poms/serp-1.11.0.pom
Downloading: http://people.apache.org/repo/m2-incubating-repository//net/sourceforge/serp/serp/1.11.0/serp-1.11.0.pom
Downloading: http://repo1.maven.org/maven2/net/sourceforge/serp/serp/1.11.0/serp-1.11.0.pom
4K downloaded
Downloading: http://download.java.net/maven/1//commons-pool/poms/commons-pool-1.3.pom
Downloading: http://people.apache.org/repo/m2-incubating-repository//commons-pool/commons-pool/1.3/commons-pool-1.3.pom
Downloading: http://repo1.maven.org/maven2/commons-pool/commons-pool/1.3/commons-pool-1.3.pom
5K downloaded
Downloading: http://download.java.net/maven/1//org.apache.openjpa/jars/openjpa-1.2.0.jar
Downloading: http://people.apache.org/repo/m2-incubating-repository//org/apache/openjpa/openjpa/1.2.0/openjpa-1.2.0.jar
Downloading: http://repo1.maven.org/maven2/org/apache/openjpa/openjpa/1.2.0/openjpa-1.2.0.jar
11437K downloaded
Downloading: http://download.java.net/maven/1//net.sourceforge.serp/jars/serp-1.11.0.jar
Downloading: http://people.apache.org/repo/m2-incubating-repository//net/sourceforge/serp/serp/1.11.0/serp-1.11.0.jar
Downloading: http://repo1.maven.org/maven2/net/sourceforge/serp/serp/1.11.0/serp-1.11.0.jar
185K downloaded
Downloading: http://download.java.net/maven/1//commons-pool/jars/commons-pool-1.3.jar
Downloading: http://people.apache.org/repo/m2-incubating-repository//commons-pool/commons-pool/1.3/commons-pool-1.3.jar
Downloading: http://repo1.maven.org/maven2/commons-pool/commons-pool/1.3/commons-pool-1.3.jar
60K downloaded
[INFO] [enforcer:enforce {execution: default}]
[INFO] [tools:copy-legal-files {execution: install-legal-files}]
[INFO] Created dir: /home/geronimo/geronimo/2.1/plugins/openjpa/geronimo-persistence-jpa10/target/classes/META-INF
[INFO] Copying 2 files to /home/geronimo/geronimo/2.1/plugins/openjpa/geronimo-persistence-jpa10/target/classes/META-INF
[INFO] [resources:resources]
[INFO] Using default encoding to copy filtered resources.
[INFO] [compiler:compile]
[INFO] Compiling 10 source files to /home/geronimo/geronimo/2.1/plugins/openjpa/geronimo-persistence-jpa10/target/classes
[INFO] [resources:testResources]
[INFO] Using default encoding to copy filtered resources.
[INFO] [compiler:testCompile]
[INFO] Compiling 4 source files to /home/geronimo/geronimo/2.1/plugins/openjpa/geronimo-persistence-jpa10/target/test-classes
[INFO] [surefire:test]
[INFO] Surefire report directory: /home/geronimo/geronimo/2.1/plugins/openjpa/geronimo-persistence-jpa10/target/surefire-reports

-------------------------------------------------------
 T E S T S
-------------------------------------------------------
Running org.apache.geronimo.persistence.PersistenceUnitGBeanTest
Tests run: 2, Failures: 0, Errors: 0, Skipped: 0, Time elapsed: 0.488 sec
Running org.apache.geronimo.persistence.CMPEntityManagerTest
Tests run: 9, Failures: 0, Errors: 9, Skipped: 0, Time elapsed: 0.101 sec <<< FAILURE!

Results :

Tests in error: 
  testGetTransaction(org.apache.geronimo.persistence.CMPEntityManagerTest)
  testJoinTransaction(org.apache.geronimo.persistence.CMPEntityManagerTest)
  testIsOpen(org.apache.geronimo.persistence.CMPEntityManagerTest)
  testSamePersistenceContext(org.apache.geronimo.persistence.CMPEntityManagerTest)
  testCloseOnCommit(org.apache.geronimo.persistence.CMPEntityManagerTest)
  testTransactionRequired(org.apache.geronimo.persistence.CMPEntityManagerTest)
  testAppCallsCloseForbidden(org.apache.geronimo.persistence.CMPEntityManagerTest)
  testNoPropertiesUsed(org.apache.geronimo.persistence.CMPEntityManagerTest)
  testPropertiesUsed(org.apache.geronimo.persistence.CMPEntityManagerTest)

Tests run: 11, Failures: 0, Errors: 9, Skipped: 0

[INFO] ------------------------------------------------------------------------
[ERROR] BUILD FAILURE
[INFO] ------------------------------------------------------------------------
[INFO] There are test failures.
[INFO] ------------------------------------------------------------------------
[INFO] Trace
org.apache.maven.BuildFailureException: There are test failures.
	at org.apache.maven.lifecycle.DefaultLifecycleExecutor.executeGoals(DefaultLifecycleExecutor.java:579)
	at org.apache.maven.lifecycle.DefaultLifecycleExecutor.executeGoalWithLifecycle(DefaultLifecycleExecutor.java:499)
	at org.apache.maven.lifecycle.DefaultLifecycleExecutor.executeGoal(DefaultLifecycleExecutor.java:478)
	at org.apache.maven.lifecycle.DefaultLifecycleExecutor.executeGoalAndHandleFailures(DefaultLifecycleExecutor.java:330)
	at org.apache.maven.lifecycle.DefaultLifecycleExecutor.executeTaskSegments(DefaultLifecycleExecutor.java:291)
	at org.apache.maven.lifecycle.DefaultLifecycleExecutor.execute(DefaultLifecycleExecutor.java:142)
	at org.apache.maven.DefaultMaven.doExecute(DefaultMaven.java:336)
	at org.apache.maven.DefaultMaven.execute(DefaultMaven.java:129)
	at org.apache.maven.cli.MavenCli.main(MavenCli.java:287)
	at sun.reflect.NativeMethodAccessorImpl.invoke0(Native Method)
	at sun.reflect.NativeMethodAccessorImpl.invoke(NativeMethodAccessorImpl.java:39)
	at sun.reflect.DelegatingMethodAccessorImpl.invoke(DelegatingMethodAccessorImpl.java:25)
	at java.lang.reflect.Method.invoke(Method.java:585)
	at org.codehaus.classworlds.Launcher.launchEnhanced(Launcher.java:315)
	at org.codehaus.classworlds.Launcher.launch(Launcher.java:255)
	at org.codehaus.classworlds.Launcher.mainWithExitCode(Launcher.java:430)
	at org.codehaus.classworlds.Launcher.main(Launcher.java:375)
Caused by: org.apache.maven.plugin.MojoFailureException: There are test failures.
	at org.apache.maven.plugin.surefire.SurefirePlugin.execute(SurefirePlugin.java:425)
	at org.apache.maven.plugin.DefaultPluginManager.executeMojo(DefaultPluginManager.java:451)
	at org.apache.maven.lifecycle.DefaultLifecycleExecutor.executeGoals(DefaultLifecycleExecutor.java:558)
	... 16 more
[INFO] ------------------------------------------------------------------------
[INFO] Total time: 14 minutes 7 seconds
[INFO] Finished at: Mon Sep 15 14:26:25 EDT 2008
[INFO] Final Memory: 213M/550M
[INFO] ------------------------------------------------------------------------

Mime
View raw message