geronimo-dev mailing list archives

Site index · List index
Message view « Date » · « Thread »
Top « Date » · « Thread »
From ga...@apache.org
Subject [BUILD] trunk: Failed for Revision: 692967
Date Mon, 08 Sep 2008 01:38:13 GMT
Geronimo Revision: 692967 built with tests included
 
See the full build-2100.log file at http://people.apache.org/builds/geronimo/server/binaries/trunk/20080907/build-2100.log
 
 
See the unit test reports at http://people.apache.org/builds/geronimo/server/binaries/trunk/20080907/unit-test-reports
 
There are no tests to run.

Results :

Tests run: 0, Failures: 0, Errors: 0, Skipped: 0

[INFO] [jar:jar]
[INFO] Building jar: /home/geronimo/geronimo/trunk/plugins/cxf/geronimo-cxf-builder/target/geronimo-cxf-builder-2.2-SNAPSHOT.jar
[INFO] [tools:verify-legal-files {execution: verify-legal-files}]
[INFO] Checking legal files in: geronimo-cxf-builder-2.2-SNAPSHOT.jar
[INFO] [ianal:verify-legal-files {execution: default}]
[INFO] Checking legal files in: geronimo-cxf-builder-2.2-SNAPSHOT.jar
[INFO] [install:install]
[INFO] Installing /home/geronimo/geronimo/trunk/plugins/cxf/geronimo-cxf-builder/target/geronimo-cxf-builder-2.2-SNAPSHOT.jar
to /home/geronimo/.m2/repository/org/apache/geronimo/modules/geronimo-cxf-builder/2.2-SNAPSHOT/geronimo-cxf-builder-2.2-SNAPSHOT.jar
[INFO] ------------------------------------------------------------------------
[INFO] Building Geronimo Plugins, CXF :: Deployer
[INFO]    task-segment: [install]
[INFO] ------------------------------------------------------------------------
[INFO] [enforcer:enforce {execution: default}]
[INFO] [remote-resources:process {execution: process}]
[INFO] [remote-resources:process {execution: default}]
[INFO] [resources:resources]
[INFO] Using default encoding to copy filtered resources.
[INFO] [car:validate-configuration]
[INFO] [car:prepare-plan]
[INFO] Generated: /home/geronimo/geronimo/trunk/plugins/cxf/cxf-deployer/target/resources/META-INF/plan.xml
[INFO] [car:verify-no-dependency-change]
[INFO] [car:package]
[INFO] Packaging module configuration: /home/geronimo/geronimo/trunk/plugins/cxf/cxf-deployer/target/resources/META-INF/plan.xml
[INFO] Started deployer: org.apache.geronimo.framework/geronimo-gbean-deployer/2.2-SNAPSHOT/car
[INFO] [car:prepare-metadata]
[INFO] [car:archive-car]
[INFO] Building jar: /home/geronimo/geronimo/trunk/plugins/cxf/cxf-deployer/target/cxf-deployer-2.2-SNAPSHOT.car
[INFO] [tools:verify-legal-files {execution: verify-legal-files}]
[INFO] Checking legal files in: cxf-deployer-2.2-SNAPSHOT.car
[INFO] [ianal:verify-legal-files {execution: default}]
[INFO] Checking legal files in: cxf-deployer-2.2-SNAPSHOT.car
[INFO] [install:install]
[INFO] Installing /home/geronimo/geronimo/trunk/plugins/cxf/cxf-deployer/target/cxf-deployer-2.2-SNAPSHOT.car
to /home/geronimo/.m2/repository/org/apache/geronimo/configs/cxf-deployer/2.2-SNAPSHOT/cxf-deployer-2.2-SNAPSHOT.car
[INFO] [car:update-pluginlist]
[INFO] ------------------------------------------------------------------------
[INFO] Building Geronimo Plugins, CXF :: EJB Core
[INFO]    task-segment: [install]
[INFO] ------------------------------------------------------------------------
[INFO] [enforcer:enforce {execution: default}]
[INFO] [remote-resources:process {execution: process}]
[INFO] [remote-resources:process {execution: default}]
[INFO] [resources:resources]
[INFO] Using default encoding to copy filtered resources.
[INFO] [compiler:compile]
[INFO] Compiling 5 source files to /home/geronimo/geronimo/trunk/plugins/cxf/geronimo-cxf-ejb/target/classes
[INFO] ------------------------------------------------------------------------
[ERROR] BUILD FAILURE
[INFO] ------------------------------------------------------------------------
[INFO] Compilation failure

/home/geronimo/geronimo/trunk/plugins/cxf/geronimo-cxf-ejb/src/main/java/org/apache/geronimo/cxf/ejb/EJBMethodInvoker.java:[35,36]
cannot find symbol
symbol  : class ContextPropertiesMapping
location: package org.apache.cxf.jaxws.support

/home/geronimo/geronimo/trunk/plugins/cxf/geronimo-cxf-ejb/src/main/java/org/apache/geronimo/cxf/ejb/EJBMethodInvoker.java:[83,29]
cannot find symbol
symbol  : variable ContextPropertiesMapping
location: class org.apache.geronimo.cxf.ejb.EJBMethodInvoker

/home/geronimo/geronimo/trunk/plugins/cxf/geronimo-cxf-ejb/src/main/java/org/apache/geronimo/cxf/ejb/EJBMethodInvoker.java:[158,8]
cannot find symbol
symbol  : variable ContextPropertiesMapping
location: class org.apache.geronimo.cxf.ejb.EJBMethodInvoker


[INFO] ------------------------------------------------------------------------
[INFO] Trace
org.apache.maven.BuildFailureException: Compilation failure
	at org.apache.maven.lifecycle.DefaultLifecycleExecutor.executeGoals(DefaultLifecycleExecutor.java:579)
	at org.apache.maven.lifecycle.DefaultLifecycleExecutor.executeGoalWithLifecycle(DefaultLifecycleExecutor.java:499)
	at org.apache.maven.lifecycle.DefaultLifecycleExecutor.executeGoal(DefaultLifecycleExecutor.java:478)
	at org.apache.maven.lifecycle.DefaultLifecycleExecutor.executeGoalAndHandleFailures(DefaultLifecycleExecutor.java:330)
	at org.apache.maven.lifecycle.DefaultLifecycleExecutor.executeTaskSegments(DefaultLifecycleExecutor.java:291)
	at org.apache.maven.lifecycle.DefaultLifecycleExecutor.execute(DefaultLifecycleExecutor.java:142)
	at org.apache.maven.DefaultMaven.doExecute(DefaultMaven.java:336)
	at org.apache.maven.DefaultMaven.execute(DefaultMaven.java:129)
	at org.apache.maven.cli.MavenCli.main(MavenCli.java:287)
	at sun.reflect.NativeMethodAccessorImpl.invoke0(Native Method)
	at sun.reflect.NativeMethodAccessorImpl.invoke(NativeMethodAccessorImpl.java:39)
	at sun.reflect.DelegatingMethodAccessorImpl.invoke(DelegatingMethodAccessorImpl.java:25)
	at java.lang.reflect.Method.invoke(Method.java:585)
	at org.codehaus.classworlds.Launcher.launchEnhanced(Launcher.java:315)
	at org.codehaus.classworlds.Launcher.launch(Launcher.java:255)
	at org.codehaus.classworlds.Launcher.mainWithExitCode(Launcher.java:430)
	at org.codehaus.classworlds.Launcher.main(Launcher.java:375)
Caused by: org.apache.maven.plugin.CompilationFailureException: Compilation failure
	at org.apache.maven.plugin.AbstractCompilerMojo.execute(AbstractCompilerMojo.java:516)
	at org.apache.maven.plugin.CompilerMojo.execute(CompilerMojo.java:114)
	at org.apache.maven.plugin.DefaultPluginManager.executeMojo(DefaultPluginManager.java:451)
	at org.apache.maven.lifecycle.DefaultLifecycleExecutor.executeGoals(DefaultLifecycleExecutor.java:558)
	... 16 more
[INFO] ------------------------------------------------------------------------
[INFO] Total time: 21 minutes 55 seconds
[INFO] Finished at: Sun Sep 07 21:25:47 EDT 2008
[INFO] Final Memory: 316M/960M
[INFO] ------------------------------------------------------------------------

Mime
View raw message