geronimo-dev mailing list archives

Site index · List index
Message view « Date » · « Thread »
Top « Date » · « Thread »
From David Jencks <david_jen...@yahoo.com>
Subject Re: [BUILD] trunk: Failed for Revision: 697804
Date Mon, 22 Sep 2008 17:55:51 GMT
We'll see how many other problems I've created but the jetty testsuite  
is now working OK for me..... lets see if the automated build also  
works.

sorry for the protracted breakage.

david jencks

On Sep 22, 2008, at 8:22 AM, gawor@apache.org wrote:

> Geronimo Revision: 697804 built with tests included
>
> See the full build-0900.log file at http://people.apache.org/builds/geronimo/server/binaries/trunk/20080922/build-0900.log
>
> Download the binaries from http://people.apache.org/builds/geronimo/server/binaries/trunk/20080922
> [INFO] BUILD SUCCESSFUL
> [INFO]  
> ------------------------------------------------------------------------
> [INFO] Total time: 58 minutes 17 seconds
> [INFO] Finished at: Mon Sep 22 10:00:42 EDT 2008
> [INFO] Final Memory: 375M/1005M
> [INFO]  
> ------------------------------------------------------------------------
>
> TESTSUITE RESULTS (Failures only)
> =================================
> See detailed results at http://people.apache.org/builds/geronimo/server/testsuite/ResultsSummary.html
>
> Assembly: tomcat
> =================================
> See the full test.log file at http://people.apache.org/builds/geronimo/server/binaries/trunk/20080922/logs-0900-tomcat/test.log
>
>
> [INFO] Using geronimoHome: /home/geronimo/geronimo/trunk/testsuite/ 
> target/geronimo-tomcat6-javaee5-2.2-SNAPSHOT
> [INFO] Installing assembly...
> [INFO] Expanding: /home/geronimo/.m2/repository/org/apache/geronimo/ 
> assemblies/geronimo-tomcat6-javaee5/2.2-SNAPSHOT/geronimo-tomcat6- 
> javaee5-2.2-SNAPSHOT-bin.zip into /home/geronimo/geronimo/trunk/ 
> testsuite/target
> [INFO] Starting Geronimo server...
> [INFO] Selected option set: default
> [INFO] Redirecting output to: /home/geronimo/geronimo/trunk/ 
> testsuite/target/geronimo-logs/ 
> org.apache.geronimo.mavenplugins.geronimo.server.StartServerMojo.log
> [INFO] Waiting for Geronimo server...
> [INFO] Geronimo server started in 0:00:39.353
> [INFO] [shitty:install {execution: default}]
> [INFO] Installing /home/geronimo/geronimo/trunk/testsuite/pom.xml  
> to /home/geronimo/.m2/repository/org/apache/geronimo/testsuite/ 
> testsuite/2.2-SNAPSHOT/testsuite-2.2-SNAPSHOT.pom
> [INFO] [shitty:test {execution: default}]
> [INFO] Starting 32 test build(s)
> [INFO]
> [INFO]  
> -------------------------------------------------------------------------------
> [INFO]
> [INFO] commands-testsuite/deploy                RUNNING
> [INFO] commands-testsuite/deploy                SUCCESS (0:05:12.662)
> [INFO] commands-testsuite/gshell                RUNNING
> [INFO] commands-testsuite/gshell                SUCCESS (0:00:29.520)
> [INFO] commands-testsuite/jaxws                 RUNNING
> [INFO] commands-testsuite/jaxws                 SUCCESS (0:00:19.398)
> [INFO] commands-testsuite/shutdown              RUNNING
> [INFO] commands-testsuite/shutdown              SUCCESS (0:00:16.436)
> [INFO] concurrent-testsuite/concurrent-basic    RUNNING
> [INFO] concurrent-testsuite/concurrent-basic    SUCCESS (0:06:14.090)
> [INFO] console-testsuite/advanced               RUNNING
> [INFO] console-testsuite/advanced               FAILURE  
> (0:00:49.551) Java returned: 1
> [INFO] console-testsuite/basic                  RUNNING
> [INFO] console-testsuite/basic                  SUCCESS (0:01:47.103)
> [INFO] corba-testsuite/corba-helloworld         RUNNING
> [INFO] corba-testsuite/corba-helloworld         FAILURE  
> (0:00:28.994) Java returned: 1
> [INFO] corba-testsuite/corba-marshal            RUNNING
> [INFO] corba-testsuite/corba-marshal            FAILURE  
> (0:00:25.359) Java returned: 1
> [INFO] corba-testsuite/corba-mytime             RUNNING
> [INFO] corba-testsuite/corba-mytime             FAILURE  
> (0:00:33.386) Java returned: 1
> [INFO] deployment-testsuite/deployment-tests    RUNNING
> [INFO] deployment-testsuite/deployment-tests    SUCCESS (0:00:29.742)
> [INFO] deployment-testsuite/jca-cms-tests       RUNNING
> [INFO] deployment-testsuite/jca-cms-tests       SUCCESS (0:00:27.296)
> [INFO] deployment-testsuite/manifestcp-tests    RUNNING
> [INFO] deployment-testsuite/manifestcp-tests    SUCCESS (0:00:29.307)
> [INFO] enterprise-testsuite/ejb-tests           RUNNING
> [INFO] enterprise-testsuite/ejb-tests           SUCCESS (0:00:42.002)
> [INFO] enterprise-testsuite/jms-tests           RUNNING
> [INFO] enterprise-testsuite/jms-tests           SUCCESS (0:00:47.375)
> [INFO] enterprise-testsuite/jpa-tests           RUNNING
> [INFO] enterprise-testsuite/jpa-tests           SUCCESS (0:00:51.874)
> [INFO] enterprise-testsuite/sec-client          RUNNING
> [INFO] enterprise-testsuite/sec-client          FAILURE  
> (0:00:14.920) Java returned: 1
> [INFO] enterprise-testsuite/sec-tests           RUNNING
> [INFO] enterprise-testsuite/sec-tests           FAILURE  
> (0:00:25.527) Java returned: 1
> [INFO] security-testsuite/test-security         RUNNING
> [INFO] security-testsuite/test-security         SUCCESS (0:00:39.724)
> [INFO] web-testsuite/test-2.1-jsps              RUNNING
> [INFO] web-testsuite/test-2.1-jsps              SUCCESS (0:00:37.513)
> [INFO] web-testsuite/test-2.5-servlets          RUNNING
> [INFO] web-testsuite/test-2.5-servlets          SUCCESS (0:00:26.312)
> [INFO] web-testsuite/test-myfaces               RUNNING
> [INFO] web-testsuite/test-myfaces               SUCCESS (0:00:33.527)
> [INFO] web-testsuite/test-tomcat                RUNNING
> [INFO] web-testsuite/test-tomcat                SUCCESS (0:00:19.475)
> [INFO] web-testsuite/test-web-forward           RUNNING
> [INFO] web-testsuite/test-web-forward           SUCCESS (0:00:31.319)
> [INFO] web-testsuite/test-web-references        RUNNING
> [INFO] web-testsuite/test-web-references        SUCCESS (0:00:36.975)
> [INFO] webservices-testsuite/jaxb-tests         RUNNING
> [INFO] webservices-testsuite/jaxb-tests         FAILURE  
> (0:00:42.870) Java returned: 1
> [INFO] webservices-testsuite/jaxr-tests         RUNNING
> [INFO] webservices-testsuite/jaxr-tests         FAILURE  
> (0:00:41.863) Java returned: 1
> [INFO] webservices-testsuite/jaxrpc-jaxws-tests RUNNING
> [INFO] webservices-testsuite/jaxrpc-jaxws-tests SUCCESS (0:00:30.264)
> [INFO] webservices-testsuite/jaxrpc-tests       RUNNING
> [INFO] webservices-testsuite/jaxrpc-tests       SUCCESS (0:00:38.416)
> [INFO] webservices-testsuite/jaxws-tests        RUNNING
> [INFO] webservices-testsuite/jaxws-tests        FAILURE  
> (0:00:42.950) Java returned: 1
> [INFO] webservices-testsuite/saaj-tests         RUNNING
> [INFO] webservices-testsuite/saaj-tests         FAILURE  
> (0:00:28.392) Java returned: 1
> [INFO] webservices-testsuite/stax-tests         RUNNING
> [INFO] webservices-testsuite/stax-tests         FAILURE  
> (0:00:42.310) Java returned: 1
> [INFO]
> [INFO]  
> -------------------------------------------------------------------------------
> [INFO] Test Summary (0:29:16.690)
> [INFO]     Passed: 21
> [INFO]     Failed: 11
> [INFO]  
> -------------------------------------------------------------------------------
> [INFO]
> [INFO] The following tests failed:
> [INFO]     * console-testsuite/advanced - /home/geronimo/geronimo/ 
> trunk/testsuite/console-testsuite/advanced/build.log
> [INFO]     * corba-testsuite/corba-helloworld - /home/geronimo/ 
> geronimo/trunk/testsuite/corba-testsuite/corba-helloworld/build.log
> [INFO]     * corba-testsuite/corba-marshal - /home/geronimo/geronimo/ 
> trunk/testsuite/corba-testsuite/corba-marshal/build.log
> [INFO]     * corba-testsuite/corba-mytime - /home/geronimo/geronimo/ 
> trunk/testsuite/corba-testsuite/corba-mytime/build.log
> [INFO]     * enterprise-testsuite/sec-client - /home/geronimo/ 
> geronimo/trunk/testsuite/enterprise-testsuite/sec-client/build.log
> [INFO]     * enterprise-testsuite/sec-tests - /home/geronimo/ 
> geronimo/trunk/testsuite/enterprise-testsuite/sec-tests/build.log
> [INFO]     * webservices-testsuite/jaxb-tests - /home/geronimo/ 
> geronimo/trunk/testsuite/webservices-testsuite/jaxb-tests/build.log
> [INFO]     * webservices-testsuite/jaxr-tests - /home/geronimo/ 
> geronimo/trunk/testsuite/webservices-testsuite/jaxr-tests/build.log
> [INFO]     * webservices-testsuite/jaxws-tests - /home/geronimo/ 
> geronimo/trunk/testsuite/webservices-testsuite/jaxws-tests/build.log
> [INFO]     * webservices-testsuite/saaj-tests - /home/geronimo/ 
> geronimo/trunk/testsuite/webservices-testsuite/saaj-tests/build.log
> [INFO]     * webservices-testsuite/stax-tests - /home/geronimo/ 
> geronimo/trunk/testsuite/webservices-testsuite/stax-tests/build.log
> [INFO]
> [INFO]  
> ------------------------------------------------------------------------
> [ERROR] BUILD ERROR
>
> Assembly: jetty
> =================================
> See the full test.log file at http://people.apache.org/builds/geronimo/server/binaries/trunk/20080922/logs-0900-jetty/test.log
>
>
> [INFO] Using geronimoHome: /home/geronimo/geronimo/trunk/testsuite/ 
> target/geronimo-jetty6-javaee5-2.2-SNAPSHOT
> [INFO] Installing assembly...
> [INFO] Expanding: /home/geronimo/.m2/repository/org/apache/geronimo/ 
> assemblies/geronimo-jetty6-javaee5/2.2-SNAPSHOT/geronimo-jetty6- 
> javaee5-2.2-SNAPSHOT-bin.zip into /home/geronimo/geronimo/trunk/ 
> testsuite/target
> [INFO] Starting Geronimo server...
> [INFO] Selected option set: default
> [INFO] Redirecting output to: /home/geronimo/geronimo/trunk/ 
> testsuite/target/geronimo-logs/ 
> org.apache.geronimo.mavenplugins.geronimo.server.StartServerMojo.log
> [INFO] Waiting for Geronimo server...
> [INFO] Geronimo server started in 0:00:42.589
> [INFO] [shitty:install {execution: default}]
> [INFO] Installing /home/geronimo/geronimo/trunk/testsuite/pom.xml  
> to /home/geronimo/.m2/repository/org/apache/geronimo/testsuite/ 
> testsuite/2.2-SNAPSHOT/testsuite-2.2-SNAPSHOT.pom
> [INFO] [shitty:test {execution: default}]
> [INFO] Starting 32 test build(s)
> [INFO]
> [INFO]  
> -------------------------------------------------------------------------------
> [INFO]
> [INFO] commands-testsuite/deploy                RUNNING
> [INFO] commands-testsuite/deploy                SUCCESS (0:01:09.945)
> [INFO] commands-testsuite/gshell                RUNNING
> [INFO] commands-testsuite/gshell                SUCCESS (0:00:30.233)
> [INFO] commands-testsuite/jaxws                 RUNNING
> [INFO] commands-testsuite/jaxws                 SUCCESS (0:00:18.382)
> [INFO] commands-testsuite/shutdown              RUNNING
> [INFO] commands-testsuite/shutdown              SUCCESS (0:00:16.823)
> [INFO] concurrent-testsuite/concurrent-basic    RUNNING
> [INFO] concurrent-testsuite/concurrent-basic    SUCCESS (0:06:08.389)
> [INFO] console-testsuite/advanced               RUNNING
> [INFO] console-testsuite/advanced               FAILURE  
> (0:00:48.862) Java returned: 1
> [INFO] console-testsuite/basic                  RUNNING
> [INFO] console-testsuite/basic                  SUCCESS (0:01:55.629)
> [INFO] corba-testsuite/corba-helloworld         RUNNING
> [INFO] corba-testsuite/corba-helloworld         FAILURE  
> (0:00:29.985) Java returned: 1
> [INFO] corba-testsuite/corba-marshal            RUNNING
> [INFO] corba-testsuite/corba-marshal            FAILURE  
> (0:00:26.909) Java returned: 1
> [INFO] corba-testsuite/corba-mytime             RUNNING
> [INFO] corba-testsuite/corba-mytime             FAILURE  
> (0:00:33.322) Java returned: 1
> [INFO] deployment-testsuite/deployment-tests    RUNNING
> [INFO] deployment-testsuite/deployment-tests    SUCCESS (0:00:31.466)
> [INFO] deployment-testsuite/jca-cms-tests       RUNNING
> [INFO] deployment-testsuite/jca-cms-tests       SUCCESS (0:00:28.724)
> [INFO] deployment-testsuite/manifestcp-tests    RUNNING
> [INFO] deployment-testsuite/manifestcp-tests    SUCCESS (0:00:31.637)
> [INFO] enterprise-testsuite/ejb-tests           RUNNING
> [INFO] enterprise-testsuite/ejb-tests           SUCCESS (0:00:34.917)
> [INFO] enterprise-testsuite/jms-tests           RUNNING
> [INFO] enterprise-testsuite/jms-tests           SUCCESS (0:00:47.851)
> [INFO] enterprise-testsuite/jpa-tests           RUNNING
> [INFO] enterprise-testsuite/jpa-tests           SUCCESS (0:00:38.587)
> [INFO] enterprise-testsuite/sec-client          RUNNING
> [INFO] enterprise-testsuite/sec-client          FAILURE  
> (0:00:15.244) Java returned: 1
> [INFO] enterprise-testsuite/sec-tests           RUNNING
> [INFO] enterprise-testsuite/sec-tests           FAILURE  
> (0:00:24.432) Java returned: 1
> [INFO] security-testsuite/test-security         RUNNING
> [INFO] security-testsuite/test-security         SUCCESS (0:00:40.837)
> [INFO] web-testsuite/test-2.1-jsps              RUNNING
> [INFO] web-testsuite/test-2.1-jsps              SUCCESS (0:00:38.191)
> [INFO] web-testsuite/test-2.5-servlets          RUNNING
> [INFO] web-testsuite/test-2.5-servlets          SUCCESS (0:00:26.655)
> [INFO] web-testsuite/test-jetty                 RUNNING
> [INFO] web-testsuite/test-jetty                 SUCCESS (0:00:21.241)
> [INFO] web-testsuite/test-myfaces               RUNNING
> [INFO] web-testsuite/test-myfaces               SUCCESS (0:00:34.117)
> [INFO] web-testsuite/test-web-forward           RUNNING
> [INFO] web-testsuite/test-web-forward           SUCCESS (0:00:31.489)
> [INFO] web-testsuite/test-web-references        RUNNING
> [INFO] web-testsuite/test-web-references        SUCCESS (0:00:37.454)
> [INFO] webservices-testsuite/jaxb-tests         RUNNING
> [INFO] webservices-testsuite/jaxb-tests         FAILURE  
> (0:00:43.508) Java returned: 1
> [INFO] webservices-testsuite/jaxr-tests         RUNNING
> [INFO] webservices-testsuite/jaxr-tests         FAILURE  
> (0:00:43.070) Java returned: 1
> [INFO] webservices-testsuite/jaxrpc-jaxws-tests RUNNING
> [INFO] webservices-testsuite/jaxrpc-jaxws-tests SUCCESS (0:00:28.750)
> [INFO] webservices-testsuite/jaxrpc-tests       RUNNING
> [INFO] webservices-testsuite/jaxrpc-tests       SUCCESS (0:00:39.412)
> [INFO] webservices-testsuite/jaxws-tests        RUNNING
> [INFO] webservices-testsuite/jaxws-tests        FAILURE  
> (0:00:39.199) Java returned: 1
> [INFO] webservices-testsuite/saaj-tests         RUNNING
> [INFO] webservices-testsuite/saaj-tests         FAILURE  
> (0:00:29.340) Java returned: 1
> [INFO] webservices-testsuite/stax-tests         RUNNING
> [INFO] webservices-testsuite/stax-tests         FAILURE  
> (0:00:43.933) Java returned: 1
> [INFO]
> [INFO]  
> -------------------------------------------------------------------------------
> [INFO] Test Summary (0:25:08.888)
> [INFO]     Passed: 21
> [INFO]     Failed: 11
> [INFO]  
> -------------------------------------------------------------------------------
> [INFO]
> [INFO] The following tests failed:
> [INFO]     * console-testsuite/advanced - /home/geronimo/geronimo/ 
> trunk/testsuite/console-testsuite/advanced/build.log
> [INFO]     * corba-testsuite/corba-helloworld - /home/geronimo/ 
> geronimo/trunk/testsuite/corba-testsuite/corba-helloworld/build.log
> [INFO]     * corba-testsuite/corba-marshal - /home/geronimo/geronimo/ 
> trunk/testsuite/corba-testsuite/corba-marshal/build.log
> [INFO]     * corba-testsuite/corba-mytime - /home/geronimo/geronimo/ 
> trunk/testsuite/corba-testsuite/corba-mytime/build.log
> [INFO]     * enterprise-testsuite/sec-client - /home/geronimo/ 
> geronimo/trunk/testsuite/enterprise-testsuite/sec-client/build.log
> [INFO]     * enterprise-testsuite/sec-tests - /home/geronimo/ 
> geronimo/trunk/testsuite/enterprise-testsuite/sec-tests/build.log
> [INFO]     * webservices-testsuite/jaxb-tests - /home/geronimo/ 
> geronimo/trunk/testsuite/webservices-testsuite/jaxb-tests/build.log
> [INFO]     * webservices-testsuite/jaxr-tests - /home/geronimo/ 
> geronimo/trunk/testsuite/webservices-testsuite/jaxr-tests/build.log
> [INFO]     * webservices-testsuite/jaxws-tests - /home/geronimo/ 
> geronimo/trunk/testsuite/webservices-testsuite/jaxws-tests/build.log
> [INFO]     * webservices-testsuite/saaj-tests - /home/geronimo/ 
> geronimo/trunk/testsuite/webservices-testsuite/saaj-tests/build.log
> [INFO]     * webservices-testsuite/stax-tests - /home/geronimo/ 
> geronimo/trunk/testsuite/webservices-testsuite/stax-tests/build.log
> [INFO]
> [INFO]  
> ------------------------------------------------------------------------
> [ERROR] BUILD ERROR
>
> Samples: trunk
> =================================
> Log: http://people.apache.org/builds/geronimo/server/binaries/trunk/20080922/samples-0900.log
>
> Build status: OK
>


Mime
View raw message