geronimo-dev mailing list archives

Site index · List index
Message view « Date » · « Thread »
Top « Date » · « Thread »
From "Ted Kirby (JIRA)" <j...@apache.org>
Subject [jira] Commented: (GERONIMODEVTOOLS-475) GEP does not build on Mac with Java 6
Date Mon, 11 Aug 2008 18:40:44 GMT

    [ https://issues.apache.org/jira/browse/GERONIMODEVTOOLS-475?page=com.atlassian.jira.plugin.system.issuetabpanels:comment-tabpanel&focusedCommentId=12621543#action_12621543
] 

Ted Kirby commented on GERONIMODEVTOOLS-475:
--------------------------------------------

~/svn/gdvtls/trunk/plugins/org.apache.geronimo.jee.v21.jaxbmodel $ mvn -e install
+ Error stacktraces are turned on.
[INFO] Scanning for projects...
[INFO] ------------------------------------------------------------------------
[INFO] Building org.apache.geronimo.jee.v21.jaxbmodel
[INFO]    task-segment: [install]
[INFO] ------------------------------------------------------------------------
[INFO] [resources:resources]
[INFO] Using default encoding to copy filtered resources.
[INFO] [compiler:compile]
[INFO] Compiling 116 source files to /Users/tedkirby/svn/gdvtls/trunk/plugins/org.apache.geronimo.jee.v21.jaxbmodel/target/classes
[INFO] ------------------------------------------------------------------------
[ERROR] BUILD FAILURE
[INFO] ------------------------------------------------------------------------
[INFO] Compilation failure
Failure executing javac, but could not parse the error:
Fatal Error: Unable to find package java.lang in classpath or bootclasspath



Failure executing javac, but could not parse the error:
Fatal Error: Unable to find package java.lang in classpath or bootclasspath


[INFO] ------------------------------------------------------------------------
[INFO] Trace
org.apache.maven.BuildFailureException: Compilation failure
Failure executing javac, but could not parse the error:
Fatal Error: Unable to find package java.lang in classpath or bootclasspath


	at org.apache.maven.lifecycle.DefaultLifecycleExecutor.executeGoals(DefaultLifecycleExecutor.java:579)
	at org.apache.maven.lifecycle.DefaultLifecycleExecutor.executeGoalWithLifecycle(DefaultLifecycleExecutor.java:499)
	at org.apache.maven.lifecycle.DefaultLifecycleExecutor.executeGoal(DefaultLifecycleExecutor.java:478)
	at org.apache.maven.lifecycle.DefaultLifecycleExecutor.executeGoalAndHandleFailures(DefaultLifecycleExecutor.java:330)
	at org.apache.maven.lifecycle.DefaultLifecycleExecutor.executeTaskSegments(DefaultLifecycleExecutor.java:291)
	at org.apache.maven.lifecycle.DefaultLifecycleExecutor.execute(DefaultLifecycleExecutor.java:142)
	at org.apache.maven.DefaultMaven.doExecute(DefaultMaven.java:336)
	at org.apache.maven.DefaultMaven.execute(DefaultMaven.java:129)
	at org.apache.maven.cli.MavenCli.main(MavenCli.java:287)
	at sun.reflect.NativeMethodAccessorImpl.invoke0(Native Method)
	at sun.reflect.NativeMethodAccessorImpl.invoke(NativeMethodAccessorImpl.java:39)
	at sun.reflect.DelegatingMethodAccessorImpl.invoke(DelegatingMethodAccessorImpl.java:25)
	at java.lang.reflect.Method.invoke(Method.java:597)
	at org.codehaus.classworlds.Launcher.launchEnhanced(Launcher.java:315)
	at org.codehaus.classworlds.Launcher.launch(Launcher.java:255)
	at org.codehaus.classworlds.Launcher.mainWithExitCode(Launcher.java:430)
	at org.codehaus.classworlds.Launcher.main(Launcher.java:375)
Caused by: org.apache.maven.plugin.CompilationFailureException: Compilation failure
Failure executing javac, but could not parse the error:
Fatal Error: Unable to find package java.lang in classpath or bootclasspath


	at org.apache.maven.plugin.AbstractCompilerMojo.execute(AbstractCompilerMojo.java:516)
	at org.apache.maven.plugin.CompilerMojo.execute(CompilerMojo.java:114)
	at org.apache.maven.plugin.DefaultPluginManager.executeMojo(DefaultPluginManager.java:451)
	at org.apache.maven.lifecycle.DefaultLifecycleExecutor.executeGoals(DefaultLifecycleExecutor.java:558)
	... 16 more
[INFO] ------------------------------------------------------------------------
[INFO] Total time: 2 seconds
[INFO] Finished at: Mon Aug 11 14:39:10 EDT 2008
[INFO] Final Memory: 10M/61M
[INFO] ------------------------------------------------------------------------


> GEP does not build on Mac with Java 6
> -------------------------------------
>
>                 Key: GERONIMODEVTOOLS-475
>                 URL: https://issues.apache.org/jira/browse/GERONIMODEVTOOLS-475
>             Project: Geronimo-Devtools
>          Issue Type: Sub-task
>            Reporter: Tim McConnell
>            Assignee: Tim McConnell
>


-- 
This message is automatically generated by JIRA.
-
You can reply to this email to add a comment to the issue online.


Mime
View raw message