geronimo-dev mailing list archives

Site index · List index
Message view « Date » · « Thread »
Top « Date » · « Thread »
From "YunFeng Ma (JIRA)" <j...@apache.org>
Subject [jira] Resolved: (GERONIMODEVTOOLS-429) Testcase failures in org.apache.geronimo.st.core plugin
Date Wed, 30 Jul 2008 01:27:31 GMT

     [ https://issues.apache.org/jira/browse/GERONIMODEVTOOLS-429?page=com.atlassian.jira.plugin.system.issuetabpanels:all-tabpanel
]

YunFeng Ma resolved GERONIMODEVTOOLS-429.
-----------------------------------------

    Resolution: Fixed

The root cause is the HashSet used in DependencyManager. HashSet makes no guarantees as to
the iteration order of the set. Now using LinkedHashSet replaces HashSet. LinkedHashSet  can
guarantee the iteration order. Committed in trunk rev680897.

> Testcase failures in org.apache.geronimo.st.core plugin
> -------------------------------------------------------
>
>                 Key: GERONIMODEVTOOLS-429
>                 URL: https://issues.apache.org/jira/browse/GERONIMODEVTOOLS-429
>             Project: Geronimo-Devtools
>          Issue Type: Bug
>          Components: eclipse-plugin
>    Affects Versions: 2.1.2
>            Reporter: Tim McConnell
>            Assignee: Tim McConnell
>             Fix For: 2.1.2
>
>
> -------------------------------------------------------------------------------
> Test set: org.apache.geronimo.st.core.internal.DependencyHelperTest
> -------------------------------------------------------------------------------
> Tests run: 6, Failures: 5, Errors: 0, Skipped: 0, Time elapsed: 0.656 sec <<<
FAILURE!
> testMultipleParents(org.apache.geronimo.st.core.internal.DependencyHelperTest)  Time
elapsed: 0.078 sec  <<< FAILURE!
> junit.framework.AssertionFailedError: expected:<javax.xml.bind.JAXBElement@6ab66ab6>
but was:<javax.xml.bind.JAXBElement@2c002c00>
> 	at junit.framework.Assert.fail(Assert.java:47)
> 	at junit.framework.Assert.failNotEquals(Assert.java:282)
> 	at junit.framework.Assert.assertEquals(Assert.java:64)
> 	at junit.framework.Assert.assertEquals(Assert.java:71)
> 	at org.apache.geronimo.st.core.internal.DependencyHelperTest.testMultipleParents(DependencyHelperTest.java:268)
> 	at org.apache.geronimo.st.core.internal.DependencyHelperTest.testMultipleParents(DependencyHelperTest.java:268)
> 	at sun.reflect.NativeMethodAccessorImpl.invoke0(Native Method)
> 	at sun.reflect.NativeMethodAccessorImpl.invoke(NativeMethodAccessorImpl.java:64)
> 	at sun.reflect.DelegatingMethodAccessorImpl.invoke(DelegatingMethodAccessorImpl.java:43)
> 	at java.lang.reflect.Method.invoke(Method.java:615)
> 	at junit.framework.TestCase.runTest(TestCase.java:154)
> 	at junit.framework.TestCase.runBare(TestCase.java:127)
> 	at junit.framework.TestResult$1.protect(TestResult.java:106)
> 	at junit.framework.TestResult.runProtected(TestResult.java:124)
> 	at junit.framework.TestResult.run(TestResult.java:109)
> 	at junit.framework.TestCase.run(TestCase.java:118)
> 	at junit.framework.TestSuite.runTest(TestSuite.java:208)
> 	at junit.framework.TestSuite.run(TestSuite.java:203)
> 	at sun.reflect.NativeMethodAccessorImpl.invoke0(Native Method)
> 	at sun.reflect.NativeMethodAccessorImpl.invoke(NativeMethodAccessorImpl.java:64)
> 	at sun.reflect.DelegatingMethodAccessorImpl.invoke(DelegatingMethodAccessorImpl.java:43)
> 	at java.lang.reflect.Method.invoke(Method.java:615)
> 	at org.apache.maven.surefire.junit.JUnitTestSet.execute(JUnitTestSet.java:213)
> 	at org.apache.maven.surefire.suite.AbstractDirectoryTestSuite.executeTestSet(AbstractDirectoryTestSuite.java:138)
> 	at org.apache.maven.surefire.suite.AbstractDirectoryTestSuite.execute(AbstractDirectoryTestSuite.java:125)
> 	at org.apache.maven.surefire.Surefire.run(Surefire.java:132)
> 	at sun.reflect.NativeMethodAccessorImpl.invoke0(Native Method)
> 	at sun.reflect.NativeMethodAccessorImpl.invoke(NativeMethodAccessorImpl.java:64)
> 	at sun.reflect.DelegatingMethodAccessorImpl.invoke(DelegatingMethodAccessorImpl.java:43)
> 	at java.lang.reflect.Method.invoke(Method.java:615)
> 	at org.apache.maven.surefire.booter.SurefireBooter.runSuitesInProcess(SurefireBooter.java:290)
> 	at org.apache.maven.surefire.booter.SurefireBooter.main(SurefireBooter.java:818)
> testMultipleChildrenAndParents1(org.apache.geronimo.st.core.internal.DependencyHelperTest)
 Time elapsed: 0.062 sec  <<< FAILURE!
> junit.framework.AssertionFailedError: expected:<javax.xml.bind.JAXBElement@692c692c>
but was:<javax.xml.bind.JAXBElement@2ee62ee6>
> 	at junit.framework.Assert.fail(Assert.java:47)
> 	at junit.framework.Assert.failNotEquals(Assert.java:282)
> 	at junit.framework.Assert.assertEquals(Assert.java:64)
> 	at junit.framework.Assert.assertEquals(Assert.java:71)
> 	at org.apache.geronimo.st.core.internal.DependencyHelperTest.testMultipleChildrenAndParents1(DependencyHelperTest.java:334)
> 	at org.apache.geronimo.st.core.internal.DependencyHelperTest.testMultipleChildrenAndParents1(DependencyHelperTest.java:334)
> 	at sun.reflect.NativeMethodAccessorImpl.invoke0(Native Method)
> 	at sun.reflect.NativeMethodAccessorImpl.invoke(NativeMethodAccessorImpl.java:64)
> 	at sun.reflect.DelegatingMethodAccessorImpl.invoke(DelegatingMethodAccessorImpl.java:43)
> 	at java.lang.reflect.Method.invoke(Method.java:615)
> 	at junit.framework.TestCase.runTest(TestCase.java:154)
> 	at junit.framework.TestCase.runBare(TestCase.java:127)
> 	at junit.framework.TestResult$1.protect(TestResult.java:106)
> 	at junit.framework.TestResult.runProtected(TestResult.java:124)
> 	at junit.framework.TestResult.run(TestResult.java:109)
> 	at junit.framework.TestCase.run(TestCase.java:118)
> 	at junit.framework.TestSuite.runTest(TestSuite.java:208)
> 	at junit.framework.TestSuite.run(TestSuite.java:203)
> 	at sun.reflect.NativeMethodAccessorImpl.invoke0(Native Method)
> 	at sun.reflect.NativeMethodAccessorImpl.invoke(NativeMethodAccessorImpl.java:64)
> 	at sun.reflect.DelegatingMethodAccessorImpl.invoke(DelegatingMethodAccessorImpl.java:43)
> 	at java.lang.reflect.Method.invoke(Method.java:615)
> 	at org.apache.maven.surefire.junit.JUnitTestSet.execute(JUnitTestSet.java:213)
> 	at org.apache.maven.surefire.suite.AbstractDirectoryTestSuite.executeTestSet(AbstractDirectoryTestSuite.java:138)
> 	at org.apache.maven.surefire.suite.AbstractDirectoryTestSuite.execute(AbstractDirectoryTestSuite.java:125)
> 	at org.apache.maven.surefire.Surefire.run(Surefire.java:132)
> 	at sun.reflect.NativeMethodAccessorImpl.invoke0(Native Method)
> 	at sun.reflect.NativeMethodAccessorImpl.invoke(NativeMethodAccessorImpl.java:64)
> 	at sun.reflect.DelegatingMethodAccessorImpl.invoke(DelegatingMethodAccessorImpl.java:43)
> 	at java.lang.reflect.Method.invoke(Method.java:615)
> 	at org.apache.maven.surefire.booter.SurefireBooter.runSuitesInProcess(SurefireBooter.java:290)
> 	at org.apache.maven.surefire.booter.SurefireBooter.main(SurefireBooter.java:818)
> testMultipleChildrenAndParents2(org.apache.geronimo.st.core.internal.DependencyHelperTest)
 Time elapsed: 0.063 sec  <<< FAILURE!
> junit.framework.AssertionFailedError: expected:<javax.xml.bind.JAXBElement@23062306>
but was:<javax.xml.bind.JAXBElement@3a283a28>
> 	at junit.framework.Assert.fail(Assert.java:47)
> 	at junit.framework.Assert.failNotEquals(Assert.java:282)
> 	at junit.framework.Assert.assertEquals(Assert.java:64)
> 	at junit.framework.Assert.assertEquals(Assert.java:71)
> 	at org.apache.geronimo.st.core.internal.DependencyHelperTest.testMultipleChildrenAndParents2(DependencyHelperTest.java:426)
> 	at org.apache.geronimo.st.core.internal.DependencyHelperTest.testMultipleChildrenAndParents2(DependencyHelperTest.java:426)
> 	at sun.reflect.NativeMethodAccessorImpl.invoke0(Native Method)
> 	at sun.reflect.NativeMethodAccessorImpl.invoke(NativeMethodAccessorImpl.java:64)
> 	at sun.reflect.DelegatingMethodAccessorImpl.invoke(DelegatingMethodAccessorImpl.java:43)
> 	at java.lang.reflect.Method.invoke(Method.java:615)
> 	at junit.framework.TestCase.runTest(TestCase.java:154)
> 	at junit.framework.TestCase.runBare(TestCase.java:127)
> 	at junit.framework.TestResult$1.protect(TestResult.java:106)
> 	at junit.framework.TestResult.runProtected(TestResult.java:124)
> 	at junit.framework.TestResult.run(TestResult.java:109)
> 	at junit.framework.TestCase.run(TestCase.java:118)
> 	at junit.framework.TestSuite.runTest(TestSuite.java:208)
> 	at junit.framework.TestSuite.run(TestSuite.java:203)
> 	at sun.reflect.NativeMethodAccessorImpl.invoke0(Native Method)
> 	at sun.reflect.NativeMethodAccessorImpl.invoke(NativeMethodAccessorImpl.java:64)
> 	at sun.reflect.DelegatingMethodAccessorImpl.invoke(DelegatingMethodAccessorImpl.java:43)
> 	at java.lang.reflect.Method.invoke(Method.java:615)
> 	at org.apache.maven.surefire.junit.JUnitTestSet.execute(JUnitTestSet.java:213)
> 	at org.apache.maven.surefire.suite.AbstractDirectoryTestSuite.executeTestSet(AbstractDirectoryTestSuite.java:138)
> 	at org.apache.maven.surefire.suite.AbstractDirectoryTestSuite.execute(AbstractDirectoryTestSuite.java:125)
> 	at org.apache.maven.surefire.Surefire.run(Surefire.java:132)
> 	at sun.reflect.NativeMethodAccessorImpl.invoke0(Native Method)
> 	at sun.reflect.NativeMethodAccessorImpl.invoke(NativeMethodAccessorImpl.java:64)
> 	at sun.reflect.DelegatingMethodAccessorImpl.invoke(DelegatingMethodAccessorImpl.java:43)
> 	at java.lang.reflect.Method.invoke(Method.java:615)
> 	at org.apache.maven.surefire.booter.SurefireBooter.runSuitesInProcess(SurefireBooter.java:290)
> 	at org.apache.maven.surefire.booter.SurefireBooter.main(SurefireBooter.java:818)
> testCircularDependency(org.apache.geronimo.st.core.internal.DependencyHelperTest)  Time
elapsed: 0.062 sec  <<< FAILURE!
> junit.framework.AssertionFailedError: expected:<javax.xml.bind.JAXBElement@77ea77ea>
but was:<javax.xml.bind.JAXBElement@1fa01fa>
> 	at junit.framework.Assert.fail(Assert.java:47)
> 	at junit.framework.Assert.failNotEquals(Assert.java:282)
> 	at junit.framework.Assert.assertEquals(Assert.java:64)
> 	at junit.framework.Assert.assertEquals(Assert.java:71)
> 	at org.apache.geronimo.st.core.internal.DependencyHelperTest.testCircularDependency(DependencyHelperTest.java:543)
> 	at org.apache.geronimo.st.core.internal.DependencyHelperTest.testCircularDependency(DependencyHelperTest.java:543)
> 	at sun.reflect.NativeMethodAccessorImpl.invoke0(Native Method)
> 	at sun.reflect.NativeMethodAccessorImpl.invoke(NativeMethodAccessorImpl.java:64)
> 	at sun.reflect.DelegatingMethodAccessorImpl.invoke(DelegatingMethodAccessorImpl.java:43)
> 	at java.lang.reflect.Method.invoke(Method.java:615)
> 	at junit.framework.TestCase.runTest(TestCase.java:154)
> 	at junit.framework.TestCase.runBare(TestCase.java:127)
> 	at junit.framework.TestResult$1.protect(TestResult.java:106)
> 	at junit.framework.TestResult.runProtected(TestResult.java:124)
> 	at junit.framework.TestResult.run(TestResult.java:109)
> 	at junit.framework.TestCase.run(TestCase.java:118)
> 	at junit.framework.TestSuite.runTest(TestSuite.java:208)
> 	at junit.framework.TestSuite.run(TestSuite.java:203)
> 	at sun.reflect.NativeMethodAccessorImpl.invoke0(Native Method)
> 	at sun.reflect.NativeMethodAccessorImpl.invoke(NativeMethodAccessorImpl.java:64)
> 	at sun.reflect.DelegatingMethodAccessorImpl.invoke(DelegatingMethodAccessorImpl.java:43)
> 	at java.lang.reflect.Method.invoke(Method.java:615)
> 	at org.apache.maven.surefire.junit.JUnitTestSet.execute(JUnitTestSet.java:213)
> 	at org.apache.maven.surefire.suite.AbstractDirectoryTestSuite.executeTestSet(AbstractDirectoryTestSuite.java:138)
> 	at org.apache.maven.surefire.suite.AbstractDirectoryTestSuite.execute(AbstractDirectoryTestSuite.java:125)
> 	at org.apache.maven.surefire.Surefire.run(Surefire.java:132)
> 	at sun.reflect.NativeMethodAccessorImpl.invoke0(Native Method)
> 	at sun.reflect.NativeMethodAccessorImpl.invoke(NativeMethodAccessorImpl.java:64)
> 	at sun.reflect.DelegatingMethodAccessorImpl.invoke(DelegatingMethodAccessorImpl.java:43)
> 	at java.lang.reflect.Method.invoke(Method.java:615)
> 	at org.apache.maven.surefire.booter.SurefireBooter.runSuitesInProcess(SurefireBooter.java:290)
> 	at org.apache.maven.surefire.booter.SurefireBooter.main(SurefireBooter.java:818)
> testCircularDependencyOnSelf(org.apache.geronimo.st.core.internal.DependencyHelperTest)
 Time elapsed: 0.047 sec  <<< FAILURE!
> junit.framework.AssertionFailedError: expected:<javax.xml.bind.JAXBElement@fce0fce>
but was:<javax.xml.bind.JAXBElement@3faa3faa>
> 	at junit.framework.Assert.fail(Assert.java:47)
> 	at junit.framework.Assert.failNotEquals(Assert.java:282)
> 	at junit.framework.Assert.assertEquals(Assert.java:64)
> 	at junit.framework.Assert.assertEquals(Assert.java:71)
> 	at org.apache.geronimo.st.core.internal.DependencyHelperTest.testCircularDependencyOnSelf(DependencyHelperTest.java:804)
> 	at org.apache.geronimo.st.core.internal.DependencyHelperTest.testCircularDependencyOnSelf(DependencyHelperTest.java:804)
> 	at sun.reflect.NativeMethodAccessorImpl.invoke0(Native Method)
> 	at sun.reflect.NativeMethodAccessorImpl.invoke(NativeMethodAccessorImpl.java:64)
> 	at sun.reflect.DelegatingMethodAccessorImpl.invoke(DelegatingMethodAccessorImpl.java:43)
> 	at java.lang.reflect.Method.invoke(Method.java:615)
> 	at junit.framework.TestCase.runTest(TestCase.java:154)
> 	at junit.framework.TestCase.runBare(TestCase.java:127)
> 	at junit.framework.TestResult$1.protect(TestResult.java:106)
> 	at junit.framework.TestResult.runProtected(TestResult.java:124)
> 	at junit.framework.TestResult.run(TestResult.java:109)
> 	at junit.framework.TestCase.run(TestCase.java:118)
> 	at junit.framework.TestSuite.runTest(TestSuite.java:208)
> 	at junit.framework.TestSuite.run(TestSuite.java:203)
> 	at sun.reflect.NativeMethodAccessorImpl.invoke0(Native Method)
> 	at sun.reflect.NativeMethodAccessorImpl.invoke(NativeMethodAccessorImpl.java:64)
> 	at sun.reflect.DelegatingMethodAccessorImpl.invoke(DelegatingMethodAccessorImpl.java:43)
> 	at java.lang.reflect.Method.invoke(Method.java:615)
> 	at org.apache.maven.surefire.junit.JUnitTestSet.execute(JUnitTestSet.java:213)
> 	at org.apache.maven.surefire.suite.AbstractDirectoryTestSuite.executeTestSet(AbstractDirectoryTestSuite.java:138)
> 	at org.apache.maven.surefire.suite.AbstractDirectoryTestSuite.execute(AbstractDirectoryTestSuite.java:125)
> 	at org.apache.maven.surefire.Surefire.run(Surefire.java:132)
> 	at sun.reflect.NativeMethodAccessorImpl.invoke0(Native Method)
> 	at sun.reflect.NativeMethodAccessorImpl.invoke(NativeMethodAccessorImpl.java:64)
> 	at sun.reflect.DelegatingMethodAccessorImpl.invoke(DelegatingMethodAccessorImpl.java:43)
> 	at java.lang.reflect.Method.invoke(Method.java:615)
> 	at org.apache.maven.surefire.booter.SurefireBooter.runSuitesInProcess(SurefireBooter.java:290)
> 	at org.apache.maven.surefire.booter.SurefireBooter.main(SurefireBooter.java:818)

-- 
This message is automatically generated by JIRA.
-
You can reply to this email to add a comment to the issue online.


Mime
View raw message