geronimo-dev mailing list archives

Site index · List index
Message view « Date » · « Thread »
Top « Date » · « Thread »
From ga...@apache.org
Subject [BUILD] trunk: Failed for Revision: 676216
Date Sat, 12 Jul 2008 19:20:46 GMT
Geronimo Revision: 676216 built with tests included
 
See the full build-1500.log file at http://people.apache.org/builds/geronimo/server/binaries/trunk/20080712/build-1500.log
 
 
See the unit test reports at http://people.apache.org/builds/geronimo/server/binaries/trunk/20080712/unit-test-reports
 
[INFO] Compiling 25 source files to /home/geronimo/geronimo/trunk/framework/modules/geronimo-security/target/test-classes
[INFO] [surefire:test]
[INFO] Surefire report directory: /home/geronimo/geronimo/trunk/framework/modules/geronimo-security/target/surefire-reports

-------------------------------------------------------
 T E S T S
-------------------------------------------------------
Running org.apache.geronimo.security.jaas.LoginCertificatePropertiesFileTest
Tests run: 7, Failures: 0, Errors: 0, Skipped: 0, Time elapsed: 1.701 sec
Running org.apache.geronimo.security.jaas.LoginPropertiesFileTest
Tests run: 7, Failures: 0, Errors: 0, Skipped: 0, Time elapsed: 0.284 sec
Running org.apache.geronimo.security.jaas.LoginCertificateChainTest
Tests run: 7, Failures: 0, Errors: 0, Skipped: 0, Time elapsed: 0.277 sec
Running org.apache.geronimo.security.ContextManagerTest
Tests run: 2, Failures: 0, Errors: 0, Skipped: 0, Time elapsed: 0.015 sec
Running org.apache.geronimo.security.jaas.TimeoutTest
Tests run: 1, Failures: 0, Errors: 0, Skipped: 0, Time elapsed: 0.04 sec
Running org.apache.geronimo.security.jaas.NoLoginModuleReuseTest
Tests run: 1, Failures: 0, Errors: 0, Skipped: 0, Time elapsed: 0.015 sec
Running org.apache.geronimo.security.jaas.LoginSQLTest
Tests run: 7, Failures: 0, Errors: 0, Skipped: 0, Time elapsed: 0.804 sec
Running org.apache.geronimo.security.jaas.LoginGeronimoPasswordCredentialTest
Tests run: 7, Failures: 0, Errors: 0, Skipped: 0, Time elapsed: 0.125 sec
Running org.apache.geronimo.security.jaas.LoginKerberosTest
Tests run: 1, Failures: 0, Errors: 0, Skipped: 0, Time elapsed: 0.022 sec
Running org.apache.geronimo.security.realm.providers.GeronimoPropertiesFileMappedPasswordCredentialLoginModuleTest
Tests run: 2, Failures: 0, Errors: 0, Skipped: 0, Time elapsed: 0.009 sec
Running org.apache.geronimo.security.jaas.LoginConfiguredIdentityNamedUsernamePasswordTest
Tests run: 7, Failures: 0, Errors: 0, Skipped: 0, Time elapsed: 0.125 sec
Running org.apache.geronimo.security.jaas.LoginKerberosNonGeronimoTest
Tests run: 1, Failures: 0, Errors: 0, Skipped: 0, Time elapsed: 0.018 sec
Running org.apache.geronimo.security.jaas.ConfigurationEntryTest
Tests run: 1, Failures: 0, Errors: 0, Skipped: 0, Time elapsed: 0.031 sec
Running org.apache.geronimo.security.jaspi.AuthConfigFactoryImplTest
Tests run: 10, Failures: 0, Errors: 8, Skipped: 0, Time elapsed: 0.053 sec <<< FAILURE!
Running org.apache.geronimo.security.jaas.LoginGeronimoPropertiesFileMappedPasswordCredentialTest
Tests run: 7, Failures: 0, Errors: 0, Skipped: 0, Time elapsed: 0.105 sec
Running org.apache.geronimo.security.jacc.mappingprovider.GeronimoPolicyConfigurationFactoryTest
Tests run: 2, Failures: 0, Errors: 0, Skipped: 0, Time elapsed: 0.018 sec
Running org.apache.geronimo.security.jaas.WrappingLoginModuleTest
Tests run: 7, Failures: 0, Errors: 0, Skipped: 0, Time elapsed: 0.114 sec
Running org.apache.geronimo.security.jaas.LoginNamedUPCredentialTest
Tests run: 7, Failures: 0, Errors: 0, Skipped: 0, Time elapsed: 0.108 sec
Running org.apache.geronimo.security.credentialstore.SimpleCredentialStoreImplTest
Tests run: 1, Failures: 0, Errors: 0, Skipped: 0, Time elapsed: 0.023 sec

Results :

Tests in error: 
  testFactory(org.apache.geronimo.security.jaspi.AuthConfigFactoryImplTest)
  testRegisterUnregister(org.apache.geronimo.security.jaspi.AuthConfigFactoryImplTest)
  testProviderWithLayerAndContext(org.apache.geronimo.security.jaspi.AuthConfigFactoryImplTest)
  testProviderWithLayer(org.apache.geronimo.security.jaspi.AuthConfigFactoryImplTest)
  testProviderContextLayer(org.apache.geronimo.security.jaspi.AuthConfigFactoryImplTest)
  testProviderDefault(org.apache.geronimo.security.jaspi.AuthConfigFactoryImplTest)
  testListenerOnRegister(org.apache.geronimo.security.jaspi.AuthConfigFactoryImplTest)
  testListenerOnUnregister(org.apache.geronimo.security.jaspi.AuthConfigFactoryImplTest)

Tests run: 85, Failures: 0, Errors: 8, Skipped: 0

[INFO] ------------------------------------------------------------------------
[ERROR] BUILD FAILURE
[INFO] ------------------------------------------------------------------------
[INFO] There are test failures.

Please refer to /home/geronimo/geronimo/trunk/framework/modules/geronimo-security/target/surefire-reports
for the individual test results.
[INFO] ------------------------------------------------------------------------
[INFO] Trace
org.apache.maven.BuildFailureException: There are test failures.

Please refer to /home/geronimo/geronimo/trunk/framework/modules/geronimo-security/target/surefire-reports
for the individual test results.
	at org.apache.maven.lifecycle.DefaultLifecycleExecutor.executeGoals(DefaultLifecycleExecutor.java:579)
	at org.apache.maven.lifecycle.DefaultLifecycleExecutor.executeGoalWithLifecycle(DefaultLifecycleExecutor.java:499)
	at org.apache.maven.lifecycle.DefaultLifecycleExecutor.executeGoal(DefaultLifecycleExecutor.java:478)
	at org.apache.maven.lifecycle.DefaultLifecycleExecutor.executeGoalAndHandleFailures(DefaultLifecycleExecutor.java:330)
	at org.apache.maven.lifecycle.DefaultLifecycleExecutor.executeTaskSegments(DefaultLifecycleExecutor.java:291)
	at org.apache.maven.lifecycle.DefaultLifecycleExecutor.execute(DefaultLifecycleExecutor.java:142)
	at org.apache.maven.DefaultMaven.doExecute(DefaultMaven.java:336)
	at org.apache.maven.DefaultMaven.execute(DefaultMaven.java:129)
	at org.apache.maven.cli.MavenCli.main(MavenCli.java:287)
	at sun.reflect.NativeMethodAccessorImpl.invoke0(Native Method)
	at sun.reflect.NativeMethodAccessorImpl.invoke(NativeMethodAccessorImpl.java:39)
	at sun.reflect.DelegatingMethodAccessorImpl.invoke(DelegatingMethodAccessorImpl.java:25)
	at java.lang.reflect.Method.invoke(Method.java:585)
	at org.codehaus.classworlds.Launcher.launchEnhanced(Launcher.java:315)
	at org.codehaus.classworlds.Launcher.launch(Launcher.java:255)
	at org.codehaus.classworlds.Launcher.mainWithExitCode(Launcher.java:430)
	at org.codehaus.classworlds.Launcher.main(Launcher.java:375)
Caused by: org.apache.maven.plugin.MojoFailureException: There are test failures.

Please refer to /home/geronimo/geronimo/trunk/framework/modules/geronimo-security/target/surefire-reports
for the individual test results.
	at org.apache.maven.plugin.surefire.SurefirePlugin.execute(SurefirePlugin.java:530)
	at org.apache.maven.plugin.DefaultPluginManager.executeMojo(DefaultPluginManager.java:451)
	at org.apache.maven.lifecycle.DefaultLifecycleExecutor.executeGoals(DefaultLifecycleExecutor.java:558)
	... 16 more
[INFO] ------------------------------------------------------------------------
[INFO] Total time: 8 minutes 12 seconds
[INFO] Finished at: Sat Jul 12 15:11:26 EDT 2008
[INFO] Final Memory: 182M/540M
[INFO] ------------------------------------------------------------------------

Mime
View raw message