geronimo-dev mailing list archives

Site index · List index
Message view « Date » · « Thread »
Top « Date » · « Thread »
From ga...@apache.org
Subject [BUILD] branches/2.1: Failed for Revision: 671271
Date Tue, 24 Jun 2008 20:29:21 GMT
Geronimo Revision: 671271 built with tests included
 
See the full build-1400.log file at http://people.apache.org/builds/geronimo/server/binaries/2.1/20080624/build-1400.log
 
Download the binaries from http://people.apache.org/builds/geronimo/server/binaries/2.1/20080624
[INFO] BUILD SUCCESSFUL
[INFO] ------------------------------------------------------------------------
[INFO] Total time: 52 minutes 46 seconds
[INFO] Finished at: Tue Jun 24 14:57:42 EDT 2008
[INFO] Final Memory: 342M/894M
[INFO] ------------------------------------------------------------------------
 
TESTSUITE RESULTS (Failures only)
=================================
See detailed results at http://people.apache.org/builds/geronimo/server/testsuite/ResultsSummary.html
 
Assembly: tomcat
=================================
See the full test.log file at http://people.apache.org/builds/geronimo/server/binaries/2.1/20080624/logs-1400-tomcat/test.log
 
[INFO] Running commands-testsuite.deploy
[INFO] Tests run: 8, Failures: 2, Errors: 0, Skipped: 0, Time elapsed: 55.306 sec <<<
FAILURE!
 
Assembly: jetty
=================================
See the full test.log file at http://people.apache.org/builds/geronimo/server/binaries/2.1/20080624/logs-1400-jetty/test.log
 
[INFO] Running commands-testsuite.deploy
[INFO] Tests run: 8, Failures: 2, Errors: 0, Skipped: 0, Time elapsed: 57.589 sec <<<
FAILURE!
 
Samples: branches/2.1
=================================
Log: http://people.apache.org/builds/geronimo/server/binaries/2.1/20080624/samples-1400.log
 
Build status: FAILED
 

Mime
View raw message