geronimo-dev mailing list archives

Site index · List index
Message view « Date » · « Thread »
Top « Date » · « Thread »
From ga...@apache.org
Subject [BUILD] branches/2.1: Failed for Revision: 668620
Date Tue, 17 Jun 2008 18:49:41 GMT
Geronimo Revision: 668620 built with tests included
 
See the full build-0800.log file at http://people.apache.org/builds/geronimo/server/binaries/2.1/20080617/build-0800.log
 
Download the binaries from http://people.apache.org/builds/geronimo/server/binaries/2.1/20080617
[INFO] BUILD SUCCESSFUL
[INFO] ------------------------------------------------------------------------
[INFO] Total time: 35 minutes 50 seconds
[INFO] Finished at: Tue Jun 17 08:43:04 EDT 2008
[INFO] Final Memory: 351M/919M
[INFO] ------------------------------------------------------------------------
 
TESTSUITE RESULTS (Failures only)
=================================
See detailed results at http://people.apache.org/builds/geronimo/server/testsuite/ResultsSummary.html
 
Assembly: tomcat
=================================
See the full test.log file at http://people.apache.org/builds/geronimo/server/binaries/2.1/20080617/logs-0800-tomcat/test.log
 
 
Assembly: jetty
=================================
See the full test.log file at http://people.apache.org/builds/geronimo/server/binaries/2.1/20080617/logs-0800-jetty/test.log
 
[INFO] Running console-testsuite.advance-test
[INFO] Tests run: 13, Failures: 1, Errors: 0, Skipped: 0, Time elapsed: 73.329 sec <<<
FAILURE!
 
	at org.codehaus.groovy.runtime.ScriptBytecodeAdapter.invokeMethodN(ScriptBytecodeAdapter.java:158)
	at org.codehaus.groovy.runtime.ScriptBytecodeAdapter.invokeMethod0(ScriptBytecodeAdapter.java:182)
	at org.codehaus.mojo.selenium.ProcessLauncher$_launch_closure1.doCall(ProcessLauncher.groovy:59)
	at sun.reflect.NativeMethodAccessorImpl.invoke0(Native Method)
	at sun.reflect.NativeMethodAccessorImpl.invoke(NativeMethodAccessorImpl.java:39)
	at sun.reflect.DelegatingMethodAccessorImpl.invoke(DelegatingMethodAccessorImpl.java:25)
	at java.lang.reflect.Method.invoke(Method.java:585)
	at org.codehaus.groovy.runtime.metaclass.ReflectionMetaMethod.invoke(ReflectionMetaMethod.java:52)
	at org.codehaus.groovy.runtime.MetaClassHelper.doMethodInvoke(MetaClassHelper.java:714)
	at groovy.lang.MetaClassImpl.invokeMethod(MetaClassImpl.java:583)
	at org.codehaus.groovy.runtime.ScriptBytecodeAdapter.invokeMethodOnCurrentN(ScriptBytecodeAdapter.java:66)
	at org.codehaus.mojo.selenium.ProcessLauncher$_launch_closure1.doCall(ProcessLauncher.groovy)
	at sun.reflect.NativeMethodAccessorImpl.invoke0(Native Method)
	at sun.reflect.NativeMethodAccessorImpl.invoke(NativeMethodAccessorImpl.java:39)
	at sun.reflect.DelegatingMethodAccessorImpl.invoke(DelegatingMethodAccessorImpl.java:25)
	at java.lang.reflect.Method.invoke(Method.java:585)
	at org.codehaus.groovy.runtime.metaclass.ReflectionMetaMethod.invoke(ReflectionMetaMethod.java:52)
	at org.codehaus.groovy.runtime.MetaClassHelper.doMethodInvoke(MetaClassHelper.java:714)
	at groovy.lang.MetaClassImpl.invokeMethod(MetaClassImpl.java:583)
	at groovy.lang.MetaClassImpl.invokeMethod(MetaClassImpl.java:476)
	at groovy.lang.Closure.call(Closure.java:174)
	at groovy.lang.Closure.call(Closure.java:169)
	at groovy.lang.Closure.run(Closure.java:250)
	at java.lang.Thread.run(Thread.java:595)

"Low Memory Detector" daemon prio=1 tid=0x68ea7958 nid=0x116e runnable [0x00000000..0x00000000]

"CompilerThread1" daemon prio=1 tid=0x68ea6528 nid=0x116d waiting on condition [0x00000000..0x68af81d8]

"CompilerThread0" daemon prio=1 tid=0x68ea5558 nid=0x116c waiting on condition [0x00000000..0x68b79058]

"AdapterThread" daemon prio=1 tid=0x68ea4558 nid=0x116b waiting on condition [0x00000000..0x00000000]

"Signal Dispatcher" daemon prio=1 tid=0x68ea36e0 nid=0x116a waiting on condition [0x00000000..0x00000000]

"Finalizer" daemon prio=1 tid=0x68e9a7d8 nid=0x1169 in Object.wait() [0x68cfd000..0x68cfd1b0]
	at java.lang.Object.wait(Native Method)
	- waiting on <0x71552308> (a java.lang.ref.ReferenceQueue$Lock)
	at java.lang.ref.ReferenceQueue.remove(ReferenceQueue.java:116)
	- locked <0x71552308> (a java.lang.ref.ReferenceQueue$Lock)
	at java.lang.ref.ReferenceQueue.remove(ReferenceQueue.java:132)
	at java.lang.ref.Finalizer$FinalizerThread.run(Finalizer.java:159)

"Reference Handler" daemon prio=1 tid=0x68e9a288 nid=0x1168 in Object.wait() [0x68d7d000..0x68d7e030]
	at java.lang.Object.wait(Native Method)
	- waiting on <0x71550fc8> (a java.lang.ref.Reference$Lock)
	at java.lang.Object.wait(Object.java:474)
	at java.lang.ref.Reference$ReferenceHandler.run(Reference.java:116)
	- locked <0x71550fc8> (a java.lang.ref.Reference$Lock)

"main" prio=1 tid=0x0805cbb8 nid=0x115e runnable [0xbfffc000..0xbfffd878]
	at java.net.SocketInputStream.socketRead0(Native Method)
	at java.net.SocketInputStream.read(SocketInputStream.java:129)
	at java.io.BufferedInputStream.fill(BufferedInputStream.java:218)
	at java.io.BufferedInputStream.read(BufferedInputStream.java:235)
	- locked <0x72eb2510> (a java.io.BufferedInputStream)
	at java.io.DataInputStream.readByte(DataInputStream.java:241)
	at sun.rmi.transport.StreamRemoteCall.executeCall(StreamRemoteCall.java:189)
	at sun.rmi.server.UnicastRef.invoke(UnicastRef.java:126)
	at com.sun.jmx.remote.internal.PRef.invoke(Unknown Source)
	at javax.management.remote.rmi.RMIConnectionImpl_Stub.invoke(Unknown Source)
	at javax.management.remote.rmi.RMIConnector$RemoteMBeanServerConnection.invoke(RMIConnector.java:972)
	at org.apache.geronimo.mavenplugins.geronimo.ServerProxy.invoke(ServerProxy.java:232)
	at org.apache.geronimo.mavenplugins.geronimo.ServerProxy.invoke(ServerProxy.java:243)
	at org.apache.geronimo.mavenplugins.geronimo.ServerProxy.listGBeans(ServerProxy.java:251)
	at org.apache.geronimo.mavenplugins.geronimo.ServerProxy.isFullyStarted(ServerProxy.java:129)
	at org.apache.geronimo.mavenplugins.geronimo.server.StartServerMojo.doExecute(StartServerMojo.java:357)
	at org.apache.geronimo.mavenplugins.geronimo.reporting.ReportingMojoSupport.execute(ReportingMojoSupport.java:99)
	at org.apache.maven.plugin.DefaultPluginManager.executeMojo(DefaultPluginManager.java:443)
	at org.apache.maven.lifecycle.DefaultLifecycleExecutor.executeGoals(DefaultLifecycleExecutor.java:539)
	at org.apache.maven.lifecycle.DefaultLifecycleExecutor.executeGoalWithLifecycle(DefaultLifecycleExecutor.java:480)
	at org.apache.maven.lifecycle.DefaultLifecycleExecutor.executeGoal(DefaultLifecycleExecutor.java:459)
	at org.apache.maven.lifecycle.DefaultLifecycleExecutor.executeGoalAndHandleFailures(DefaultLifecycleExecutor.java:311)
	at org.apache.maven.lifecycle.DefaultLifecycleExecutor.executeTaskSegments(DefaultLifecycleExecutor.java:278)
	at org.apache.maven.lifecycle.DefaultLifecycleExecutor.execute(DefaultLifecycleExecutor.java:143)
	at org.apache.maven.DefaultMaven.doExecute(DefaultMaven.java:334)
	at org.apache.maven.DefaultMaven.execute(DefaultMaven.java:125)
	at org.apache.maven.cli.MavenCli.main(MavenCli.java:280)
	at sun.reflect.NativeMethodAccessorImpl.invoke0(Native Method)
	at sun.reflect.NativeMethodAccessorImpl.invoke(NativeMethodAccessorImpl.java:39)
	at sun.reflect.DelegatingMethodAccessorImpl.invoke(DelegatingMethodAccessorImpl.java:25)
	at java.lang.reflect.Method.invoke(Method.java:585)
	at org.codehaus.classworlds.Launcher.launchEnhanced(Launcher.java:315)
	at org.codehaus.classworlds.Launcher.launch(Launcher.java:255)
	at org.codehaus.classworlds.Launcher.mainWithExitCode(Launcher.java:430)
	at org.codehaus.classworlds.Launcher.main(Launcher.java:375)

"VM Thread" prio=1 tid=0x68e97e68 nid=0x1167 runnable 

"GC task thread#0 (ParallelGC)" prio=1 tid=0x08076bf0 nid=0x1163 runnable 

"GC task thread#1 (ParallelGC)" prio=1 tid=0x08077840 nid=0x1164 runnable 

"GC task thread#2 (ParallelGC)" prio=1 tid=0x08078478 nid=0x1165 runnable 

"GC task thread#3 (ParallelGC)" prio=1 tid=0x080790b0 nid=0x1166 runnable 

"VM Periodic Task Thread" prio=1 tid=0x68ea8ef8 nid=0x116f waiting on condition 

[INFO] ------------------------------------------------------------------------
[ERROR] BUILD ERROR
 
Samples: branches/2.1
=================================
Log: http://people.apache.org/builds/geronimo/server/binaries/2.1/20080617/samples-0800.log
 
Build status: FAILED
 

Mime
View raw message