geronimo-dev mailing list archives

Site index · List index
Message view « Date » · « Thread »
Top « Date » · « Thread »
From ga...@apache.org
Subject [BUILD] trunk: Failed for Revision: 667911
Date Sun, 15 Jun 2008 02:35:36 GMT
Geronimo Revision: 667911 built with tests included
 
See the full build-2100.log file at http://people.apache.org/builds/geronimo/server/binaries/trunk/20080614/build-2100.log
 
Download the binaries from http://people.apache.org/builds/geronimo/server/binaries/trunk/20080614
[INFO] BUILD SUCCESSFUL
[INFO] ------------------------------------------------------------------------
[INFO] Total time: 31 minutes 36 seconds
[INFO] Finished at: Sat Jun 14 21:34:53 EDT 2008
[INFO] Final Memory: 383M/1006M
[INFO] ------------------------------------------------------------------------
 
TESTSUITE RESULTS (Failures only)
=================================
See detailed results at http://people.apache.org/builds/geronimo/server/testsuite/ResultsSummary.html
 
Assembly: tomcat
=================================
See the full test.log file at http://people.apache.org/builds/geronimo/server/binaries/trunk/20080614/logs-2100-tomcat/test.log
 
 
[INFO] Including display properties from: /home/geronimo/geronimo/trunk/testsuite/target/selenium/display.properties
[INFO] Redirecting output to: /home/geronimo/geronimo/trunk/testsuite/target/selenium/server.log
[INFO] User extensions: /home/geronimo/geronimo/trunk/testsuite/target/selenium/user-extensions.js
Selenium Server started
Downloading: http://download.java.net/maven/1//woodstox/poms/wstx-asl-3.2.1.pom
Downloading: http://people.apache.org/repo/m2-incubating-repository//woodstox/wstx-asl/3.2.1/wstx-asl-3.2.1.pom
Downloading: http://repo1.maven.org/maven2/woodstox/wstx-asl/3.2.1/wstx-asl-3.2.1.pom
Downloading: http://download.java.net/maven/1//woodstox/poms/wstx-asl-3.2.1.pom
Downloading: http://people.apache.org/repo/m2-incubating-repository//woodstox/wstx-asl/3.2.1/wstx-asl-3.2.1.pom
Downloading: http://repo1.maven.org/maven2/woodstox/wstx-asl/3.2.1/wstx-asl-3.2.1.pom
[INFO] [geronimo:start-server {execution: start}]
[INFO] Using assembly configuration: tomcat
[INFO] snapshot org.apache.geronimo.assemblies:geronimo-tomcat6-javaee5:2.2-SNAPSHOT: checking
for updates from apache-snapshots
[INFO] snapshot org.apache.geronimo.assemblies:geronimo-tomcat6-javaee5:2.2-SNAPSHOT: checking
for updates from codehaus-snapshots
[INFO] snapshot org.apache.geronimo.assemblies:geronimo-tomcat6-javaee5:2.2-SNAPSHOT: checking
for updates from apache.snapshots
[INFO] Using assembly artifact: org.apache.geronimo.assemblies:geronimo-tomcat6-javaee5:zip:bin:2.2-SNAPSHOT:provided
[INFO] Using geronimoHome: /home/geronimo/geronimo/trunk/testsuite/target/geronimo-tomcat6-javaee5-2.2-SNAPSHOT
[INFO] Installing assembly...
[INFO] Expanding: /home/geronimo/.m2/repository/org/apache/geronimo/assemblies/geronimo-tomcat6-javaee5/2.2-SNAPSHOT/geronimo-tomcat6-javaee5-2.2-SNAPSHOT-bin.zip
into /home/geronimo/geronimo/trunk/testsuite/target
[INFO] Starting Geronimo server...
[INFO] Selected option set: default
[INFO] Redirecting output to: /home/geronimo/geronimo/trunk/testsuite/target/geronimo-logs/org.apache.geronimo.mavenplugins.geronimo.server.StartServerMojo.log
[INFO] Waiting for Geronimo server...
[INFO] Geronimo server started in 0:00:38.494
[INFO] [shitty:install {execution: default}]
[INFO] Installing /home/geronimo/geronimo/trunk/testsuite/pom.xml to /home/geronimo/.m2/repository/org/apache/geronimo/testsuite/testsuite/2.2-SNAPSHOT/testsuite-2.2-SNAPSHOT.pom
[INFO] [shitty:test {execution: default}]
[INFO] Starting 29 test build(s)
[INFO] 
[INFO] -------------------------------------------------------------------------------
[INFO] 
[INFO] commands-testsuite/deploy                RUNNING
[INFO] commands-testsuite/deploy                SUCCESS (0:00:28.807) 
[INFO] commands-testsuite/gshell                RUNNING
[INFO] commands-testsuite/gshell                SUCCESS (0:00:28.372) 
[INFO] console-testsuite/advanced               RUNNING
[INFO] console-testsuite/advanced               SUCCESS (0:01:36.979) 
[INFO] console-testsuite/basic                  RUNNING
[INFO] console-testsuite/basic                  SUCCESS (0:01:39.627) 
[INFO] corba-testsuite/corba-helloworld         RUNNING
[INFO] corba-testsuite/corba-helloworld         SUCCESS (0:00:45.223) 
[INFO] corba-testsuite/corba-marshal            RUNNING
[INFO] corba-testsuite/corba-marshal            SUCCESS (0:00:46.845) 
[INFO] corba-testsuite/corba-mytime             RUNNING
[INFO] corba-testsuite/corba-mytime             SUCCESS (0:00:43.618) 
[INFO] deployment-testsuite/deployment-tests    RUNNING
[INFO] deployment-testsuite/deployment-tests    SUCCESS (0:00:30.099) 
[INFO] deployment-testsuite/jca-cms-tests       RUNNING
[INFO] deployment-testsuite/jca-cms-tests       SUCCESS (0:00:28.564) 
[INFO] deployment-testsuite/manifestcp-tests    RUNNING
[INFO] deployment-testsuite/manifestcp-tests    SUCCESS (0:00:28.754) 
[INFO] enterprise-testsuite/ejb-tests           RUNNING
[INFO] enterprise-testsuite/ejb-tests           SUCCESS (0:00:36.447) 
[INFO] enterprise-testsuite/jms-tests           RUNNING
[INFO] enterprise-testsuite/jms-tests           SUCCESS (0:00:44.221) 
[INFO] enterprise-testsuite/jpa-tests           RUNNING
[INFO] enterprise-testsuite/jpa-tests           SUCCESS (0:00:39.128) 
[INFO] enterprise-testsuite/sec-client          RUNNING
[INFO] enterprise-testsuite/sec-client          SUCCESS (0:00:27.480) 
[INFO] enterprise-testsuite/sec-tests           RUNNING
[INFO] enterprise-testsuite/sec-tests           SUCCESS (0:00:45.628) 
[INFO] security-testsuite/test-security         RUNNING
[INFO] security-testsuite/test-security         SUCCESS (0:00:36.648) 
[INFO] web-testsuite/test-2.1-jsps              RUNNING
[INFO] web-testsuite/test-2.1-jsps              SUCCESS (0:00:32.719) 
[INFO] web-testsuite/test-2.5-servlets          RUNNING
[INFO] web-testsuite/test-2.5-servlets          SUCCESS (0:00:25.822) 
[INFO] web-testsuite/test-myfaces               RUNNING
[INFO] web-testsuite/test-myfaces               SUCCESS (0:00:30.817) 
[INFO] web-testsuite/test-tomcat                RUNNING
[INFO] web-testsuite/test-tomcat                FAILURE (0:00:14.350) Java returned: 1
[INFO] web-testsuite/test-web-forward           RUNNING
[INFO] web-testsuite/test-web-forward           SUCCESS (0:00:31.571) 
[INFO] web-testsuite/test-web-references        RUNNING
[INFO] web-testsuite/test-web-references        SUCCESS (0:00:35.870) 
[INFO] webservices-testsuite/jaxb-tests         RUNNING
[INFO] webservices-testsuite/jaxb-tests         SUCCESS (0:00:47.124) 
[INFO] webservices-testsuite/jaxr-tests         RUNNING
[INFO] webservices-testsuite/jaxr-tests         SUCCESS (0:00:44.906) 
[INFO] webservices-testsuite/jaxrpc-jaxws-tests RUNNING
[INFO] webservices-testsuite/jaxrpc-jaxws-tests SUCCESS (0:00:30.697) 
[INFO] webservices-testsuite/jaxrpc-tests       RUNNING
[INFO] webservices-testsuite/jaxrpc-tests       SUCCESS (0:00:36.071) 
[INFO] webservices-testsuite/jaxws-tests        RUNNING
[INFO] webservices-testsuite/jaxws-tests        SUCCESS (0:01:09.713) 
[INFO] webservices-testsuite/saaj-tests         RUNNING
[INFO] webservices-testsuite/saaj-tests         SUCCESS (0:00:34.968) 
[INFO] webservices-testsuite/stax-tests         RUNNING
[INFO] webservices-testsuite/stax-tests         SUCCESS (0:00:47.931) 
[INFO] 
[INFO] -------------------------------------------------------------------------------
[INFO] Test Summary (0:19:49.189)
[INFO]     Passed: 28
[INFO]     Failed: 1
[INFO] -------------------------------------------------------------------------------
[INFO] 
[INFO] The following tests failed:
[INFO]     * web-testsuite/test-tomcat - /home/geronimo/geronimo/trunk/testsuite/web-testsuite/test-tomcat/build.log
[INFO] 
[INFO] ------------------------------------------------------------------------
[ERROR] BUILD ERROR
 
Assembly: jetty
=================================
See the full test.log file at http://people.apache.org/builds/geronimo/server/binaries/trunk/20080614/logs-2100-jetty/test.log
 
 
[INFO] Including display properties from: /home/geronimo/geronimo/trunk/testsuite/target/selenium/display.properties
[INFO] Redirecting output to: /home/geronimo/geronimo/trunk/testsuite/target/selenium/server.log
[INFO] User extensions: /home/geronimo/geronimo/trunk/testsuite/target/selenium/user-extensions.js
Selenium Server started
Downloading: http://download.java.net/maven/1//woodstox/poms/wstx-asl-3.2.1.pom
Downloading: http://people.apache.org/repo/m2-incubating-repository//woodstox/wstx-asl/3.2.1/wstx-asl-3.2.1.pom
Downloading: http://repo1.maven.org/maven2/woodstox/wstx-asl/3.2.1/wstx-asl-3.2.1.pom
Downloading: http://download.java.net/maven/1//woodstox/poms/wstx-asl-3.2.1.pom
Downloading: http://people.apache.org/repo/m2-incubating-repository//woodstox/wstx-asl/3.2.1/wstx-asl-3.2.1.pom
Downloading: http://repo1.maven.org/maven2/woodstox/wstx-asl/3.2.1/wstx-asl-3.2.1.pom
[INFO] [geronimo:start-server {execution: start}]
[INFO] Using assembly configuration: jetty
[INFO] snapshot org.apache.geronimo.assemblies:geronimo-jetty6-javaee5:2.2-SNAPSHOT: checking
for updates from apache-snapshots
[INFO] snapshot org.apache.geronimo.assemblies:geronimo-jetty6-javaee5:2.2-SNAPSHOT: checking
for updates from codehaus-snapshots
[INFO] snapshot org.apache.geronimo.assemblies:geronimo-jetty6-javaee5:2.2-SNAPSHOT: checking
for updates from apache.snapshots
[INFO] Using assembly artifact: org.apache.geronimo.assemblies:geronimo-jetty6-javaee5:zip:bin:2.2-SNAPSHOT:provided
[INFO] Using geronimoHome: /home/geronimo/geronimo/trunk/testsuite/target/geronimo-jetty6-javaee5-2.2-SNAPSHOT
[INFO] Installing assembly...
[INFO] Expanding: /home/geronimo/.m2/repository/org/apache/geronimo/assemblies/geronimo-jetty6-javaee5/2.2-SNAPSHOT/geronimo-jetty6-javaee5-2.2-SNAPSHOT-bin.zip
into /home/geronimo/geronimo/trunk/testsuite/target
[INFO] Starting Geronimo server...
[INFO] Selected option set: default
[INFO] Redirecting output to: /home/geronimo/geronimo/trunk/testsuite/target/geronimo-logs/org.apache.geronimo.mavenplugins.geronimo.server.StartServerMojo.log
[INFO] Waiting for Geronimo server...
[INFO] Geronimo server started in 0:00:40.586
[INFO] [shitty:install {execution: default}]
[INFO] Installing /home/geronimo/geronimo/trunk/testsuite/pom.xml to /home/geronimo/.m2/repository/org/apache/geronimo/testsuite/testsuite/2.2-SNAPSHOT/testsuite-2.2-SNAPSHOT.pom
[INFO] [shitty:test {execution: default}]
[INFO] Starting 29 test build(s)
[INFO] 
[INFO] -------------------------------------------------------------------------------
[INFO] 
[INFO] commands-testsuite/deploy                RUNNING
[INFO] commands-testsuite/deploy                SUCCESS (0:00:28.655) 
[INFO] commands-testsuite/gshell                RUNNING
[INFO] commands-testsuite/gshell                SUCCESS (0:00:29.158) 
[INFO] console-testsuite/advanced               RUNNING
[INFO] console-testsuite/advanced               FAILURE (0:01:19.898) Java returned: 1
[INFO] console-testsuite/basic                  RUNNING
[INFO] console-testsuite/basic                  SUCCESS (0:01:45.867) 
[INFO] corba-testsuite/corba-helloworld         RUNNING
[INFO] corba-testsuite/corba-helloworld         SUCCESS (0:00:44.731) 
[INFO] corba-testsuite/corba-marshal            RUNNING
[INFO] corba-testsuite/corba-marshal            SUCCESS (0:01:19.177) 
[INFO] corba-testsuite/corba-mytime             RUNNING
[INFO] corba-testsuite/corba-mytime             SUCCESS (0:00:42.622) 
[INFO] deployment-testsuite/deployment-tests    RUNNING
[INFO] deployment-testsuite/deployment-tests    SUCCESS (0:00:30.714) 
[INFO] deployment-testsuite/jca-cms-tests       RUNNING
[INFO] deployment-testsuite/jca-cms-tests       SUCCESS (0:00:28.756) 
[INFO] deployment-testsuite/manifestcp-tests    RUNNING
[INFO] deployment-testsuite/manifestcp-tests    SUCCESS (0:00:28.721) 
[INFO] enterprise-testsuite/ejb-tests           RUNNING
[INFO] enterprise-testsuite/ejb-tests           SUCCESS (0:00:31.284) 
[INFO] enterprise-testsuite/jms-tests           RUNNING
[INFO] enterprise-testsuite/jms-tests           SUCCESS (0:00:44.275) 
[INFO] enterprise-testsuite/jpa-tests           RUNNING
[INFO] enterprise-testsuite/jpa-tests           SUCCESS (0:00:37.964) 
[INFO] enterprise-testsuite/sec-client          RUNNING
[INFO] enterprise-testsuite/sec-client          SUCCESS (0:00:28.745) 
[INFO] enterprise-testsuite/sec-tests           RUNNING
[INFO] enterprise-testsuite/sec-tests           SUCCESS (0:00:46.121) 
[INFO] security-testsuite/test-security         RUNNING
[INFO] security-testsuite/test-security         SUCCESS (0:00:37.724) 
[INFO] web-testsuite/test-2.1-jsps              RUNNING
[INFO] web-testsuite/test-2.1-jsps              SUCCESS (0:00:32.963) 
[INFO] web-testsuite/test-2.5-servlets          RUNNING
[INFO] web-testsuite/test-2.5-servlets          SUCCESS (0:00:26.699) 
[INFO] web-testsuite/test-jetty                 RUNNING
[INFO] web-testsuite/test-jetty                 SUCCESS (0:00:20.029) 
[INFO] web-testsuite/test-myfaces               RUNNING
[INFO] web-testsuite/test-myfaces               SUCCESS (0:00:31.087) 
[INFO] web-testsuite/test-web-forward           RUNNING
[INFO] web-testsuite/test-web-forward           SUCCESS (0:00:32.998) 
[INFO] web-testsuite/test-web-references        RUNNING
[INFO] web-testsuite/test-web-references        SUCCESS (0:00:36.038) 
[INFO] webservices-testsuite/jaxb-tests         RUNNING
[INFO] webservices-testsuite/jaxb-tests         SUCCESS (0:00:48.192) 
[INFO] webservices-testsuite/jaxr-tests         RUNNING
[INFO] webservices-testsuite/jaxr-tests         SUCCESS (0:00:47.260) 
[INFO] webservices-testsuite/jaxrpc-jaxws-tests RUNNING
[INFO] webservices-testsuite/jaxrpc-jaxws-tests SUCCESS (0:00:28.268) 
[INFO] webservices-testsuite/jaxrpc-tests       RUNNING
[INFO] webservices-testsuite/jaxrpc-tests       SUCCESS (0:00:36.017) 
[INFO] webservices-testsuite/jaxws-tests        RUNNING
[INFO] webservices-testsuite/jaxws-tests        SUCCESS (0:01:06.003) 
[INFO] webservices-testsuite/saaj-tests         RUNNING
[INFO] webservices-testsuite/saaj-tests         SUCCESS (0:00:35.777) 
[INFO] webservices-testsuite/stax-tests         RUNNING
[INFO] webservices-testsuite/stax-tests         SUCCESS (0:00:47.749) 
[INFO] 
[INFO] -------------------------------------------------------------------------------
[INFO] Test Summary (0:20:13.680)
[INFO]     Passed: 28
[INFO]     Failed: 1
[INFO] -------------------------------------------------------------------------------
[INFO] 
[INFO] The following tests failed:
[INFO]     * console-testsuite/advanced - /home/geronimo/geronimo/trunk/testsuite/console-testsuite/advanced/build.log
[INFO] 
[INFO] ------------------------------------------------------------------------
[ERROR] BUILD ERROR
 
Samples: trunk
=================================
Log: http://people.apache.org/builds/geronimo/server/binaries/trunk/20080614/samples-2100.log
 
Build status: OK
 

Mime
View raw message