geronimo-dev mailing list archives

Site index · List index
Message view « Date » · « Thread »
Top « Date » · « Thread »
From Jason Dillon <ja...@planet57.com>
Subject Re: [BUILD] trunk: Failed for Revision: 653691
Date Tue, 06 May 2008 09:16:58 GMT
You might want to flip off the color for these automated builds, mvn - 
Dcolor=false or something.

--jason


On May 6, 2008, at 3:46 PM, gawor@apache.org wrote:

> Geronimo Revision: 653691 built with tests included
>
> See the full build-0300.log file at http://people.apache.org/builds/geronimo/server/binaries/trunk/20080506/build-0300.log
>
> Download the binaries from http://people.apache.org/builds/geronimo/server/binaries/trunk/20080506
> [INFO] BUILD SUCCESSFUL
> [INFO]  
> ------------------------------------------------------------------------
> [INFO] Total time: 33 minutes 7 seconds
> [INFO] Finished at: Tue May 06 03:39:06 EDT 2008
> [INFO] Final Memory: 334M/703M
> [INFO]  
> ------------------------------------------------------------------------
>
> TESTSUITE RESULTS (Failures only)
> =================================
> See detailed results at http://people.apache.org/builds/geronimo/server/testsuite/ResultsSummary.html
>
> Assembly: tomcat
> =================================
> See the full test.log file at http://people.apache.org/builds/geronimo/server/binaries/trunk/20080506/logs-0300-tomcat/test.log
>
>
> Assembly: jetty
> =================================
> See the full test.log file at http://people.apache.org/builds/geronimo/server/binaries/trunk/20080506/logs-0300-jetty/test.log
>
>
> [INFO] test-2.1-jsps       SUCCESS (0:00:34.371)
> [INFO] test-2.5-servlets   RUNNING
> [INFO] test-2.5-servlets   SUCCESS (0:00:23.417)
> [INFO] test-jetty          RUNNING
> [INFO] test-jetty          SUCCESS (0:00:17.658)
> [INFO] test-myfaces        RUNNING
> [INFO] test-myfaces        SUCCESS (0:00:28.923)
> [INFO] test-web-forward    RUNNING
> [INFO] test-web-forward    SUCCESS (0:00:29.071)
> [INFO] test-web-references RUNNING
> [INFO] test-web-references SUCCESS (0:00:35.526)
> [INFO]
> [INFO]  
> -------------------------------------------------------------------------------
> [INFO] Test Summary (0:02:48.993)
> [INFO]     Passed: 6
> [INFO]     Failed: 0
> [INFO]  
> -------------------------------------------------------------------------------
> [INFO]
> [INFO] [selenium:stop-server {execution: stop}]
> [INFO] Stopping Selenium server...
> [INFO] [ianal:verify-legal-files {execution: default}]
> [INFO] [install:install]
> [INFO] Installing /home/geronimo/geronimo/trunk/testsuite/web- 
> testsuite/pom.xml to /home/geronimo/.m2/repository/org/apache/ 
> geronimo/testsuite/web-testsuite/2.2-SNAPSHOT/web-testsuite-2.2- 
> SNAPSHOT.pom
> [INFO] [geronimo:stop-server {execution: stop}]
> [INFO] Stopping Geronimo server...
> [INFO] [testsuite:generate-surefire-xml {execution: default}]
> [INFO] Updating directory: /home/geronimo/geronimo/trunk/testsuite/ 
> target/surefire-reports
> [INFO] Loading surefire xml for xmlproperty: /home/geronimo/geronimo/ 
> trunk/testsuite/web-testsuite/target/surefire-reports/TEST- 
> org.apache.geronimo.mavenplugins.geronimo.server.StopServerMojo.xml
> [INFO] Loading surefire xml for xmlproperty: /home/geronimo/geronimo/ 
> trunk/testsuite/web-testsuite/target/surefire-reports/TEST- 
> org.apache.geronimo.mavenplugins.geronimo.server.StartServerMojo.xml
> [INFO] Loading parent surefire xml for xmlproperty: /home/geronimo/ 
> geronimo/trunk/testsuite/target/surefire-reports/TEST-web- 
> testsuite.xml
> [INFO]  
> ----------------------------------------------------------------------------
> [INFO] Building Geronimo TestSuite :: WebServices TestSuite
> [INFO]    task-segment: [install]
> [INFO]  
> ----------------------------------------------------------------------------
> [INFO] [enforcer:enforce {execution: default}]
> [INFO] [shitty:clean {execution: default}]
> [INFO] [remote-resources:process {execution: default}]
> [INFO] [selenium:xvfb {execution: xvfb}]
> [INFO] Starting Xvfb...
> [INFO] Using display: :26
> [INFO] Using Xauthority file: /tmp/Xvfb44689.Xauthority
> Deleting: /tmp/Xvfb44689.Xauthority
> /usr/bin/xauth:  creating new authority file /tmp/Xvfb44689.Xauthority
> Created dir: /home/geronimo/geronimo/trunk/testsuite/webservices- 
> testsuite/target/selenium
> Launching Xvfb
> Waiting for Xvfb...
> [INFO] Redirecting output to: /home/geronimo/geronimo/trunk/ 
> testsuite/webservices-testsuite/target/selenium/xvfb.log
> Xvfb started
> [INFO] [site:attach-descriptor]
> [INFO] [selenium:start-server {execution: start}]
> [INFO] Starting Selenium server...
> Launching Selenium Server
> Waiting for Selenium Server...
> [INFO] Including display properties from: /home/geronimo/geronimo/ 
> trunk/testsuite/webservices-testsuite/target/selenium/ 
> display.properties
> [INFO] Redirecting output to: /home/geronimo/geronimo/trunk/ 
> testsuite/webservices-testsuite/target/selenium/server.log
> [INFO] User extensions: /home/geronimo/geronimo/trunk/testsuite/ 
> webservices-testsuite/target/selenium/user-extensions.js
> Selenium Server started
> [INFO] [geronimo:start-server {execution: start}]
> [INFO] Using assembly configuration: jetty
> [INFO] Using assembly artifact:  
> org.apache.geronimo.assemblies:geronimo-jetty6-javaee5:zip:bin:2.2- 
> SNAPSHOT
> [INFO] Using geronimoHome: /home/geronimo/geronimo/trunk/testsuite/ 
> webservices-testsuite/target/geronimo-jetty6-javaee5-2.2-SNAPSHOT
> [INFO] Installing assembly...
> [INFO] Expanding: /home/geronimo/.m2/repository/org/apache/geronimo/ 
> assemblies/geronimo-jetty6-javaee5/2.2-SNAPSHOT/geronimo-jetty6- 
> javaee5-2.2-SNAPSHOT-bin.zip into /home/geronimo/geronimo/trunk/ 
> testsuite/webservices-testsuite/target
> [INFO] Starting Geronimo server...
> [INFO] Selected option set: default
> [INFO] Redirecting output to: /home/geronimo/geronimo/trunk/ 
> testsuite/webservices-testsuite/target/geronimo-logs/ 
> org.apache.geronimo.mavenplugins.geronimo.server.StartServerMojo.log
> [INFO] Waiting for Geronimo server...
> [INFO] Geronimo server started in 0:00:39.686
> [INFO] [shitty:install {execution: default}]
> [INFO] Installing /home/geronimo/geronimo/trunk/testsuite/ 
> webservices-testsuite/pom.xml to /home/geronimo/.m2/repository/org/ 
> apache/geronimo/testsuite/webservices-testsuite/2.2-SNAPSHOT/ 
> webservices-testsuite-2.2-SNAPSHOT.pom
> [INFO] [shitty:test {execution: default}]
> [INFO] Starting 7 test build(s)
> [INFO]
> [INFO]  
> -------------------------------------------------------------------------------
> [INFO]
> [INFO] jaxb-tests         RUNNING
> [INFO] jaxb-tests         SUCCESS (0:00:44.426)
> [INFO] jaxr-tests         RUNNING
> [INFO] jaxr-tests         SUCCESS (0:00:39.884)
> [INFO] jaxrpc-jaxws-tests RUNNING
> [INFO] jaxrpc-jaxws-tests SUCCESS (0:00:27.834)
> [INFO] jaxrpc-tests       RUNNING
> [INFO] jaxrpc-tests       SUCCESS (0:00:31.086)
> [INFO] jaxws-tests        RUNNING
> [INFO] jaxws-tests        FAILURE (0:00:24.608)  
> Java returned: 1
> [INFO] saaj-tests         RUNNING
> [INFO] saaj-tests         SUCCESS (0:00:31.589)
> [INFO] stax-tests         RUNNING
> [INFO] stax-tests         SUCCESS (0:00:39.281)
> [INFO]
> [INFO]  
> -------------------------------------------------------------------------------
> [INFO] Test Summary (0:03:58.738)
> [INFO]     Passed: 6
> [INFO]     Failed: 1
> [INFO]  
> -------------------------------------------------------------------------------
> [INFO]
> [INFO] The following tests failed:
> [INFO]     * jaxws-tests - /home/geronimo/geronimo/ 
> trunk/testsuite/webservices-testsuite/jaxws-tests/build.log
> [INFO]
> [INFO]  
> ------------------------------------------------------------------------
> [ERROR] BUILD ERROR
>
> Samples: trunk
> =================================
> Log: http://people.apache.org/builds/geronimo/server/binaries/trunk/20080506/samples-0300.log
>
> Build status: FAILED
>


Mime
View raw message