geronimo-dev mailing list archives

Site index · List index
Message view « Date » · « Thread »
Top « Date » · « Thread »
From "Jarek Gawor" <jga...@gmail.com>
Subject Re: [BUILD] trunk: Failed for Revision: 655356
Date Mon, 12 May 2008 17:29:31 GMT
Something like:

cd testsuite
mvn -B -Pheadless,default -Dcolor=false -DassemblyId=$CONTAINER
-DexcludeTest=$EXCLUDE_TESTS

Jarek

On Mon, May 12, 2008 at 4:16 AM, Jason Dillon <jason@planet57.com> wrote:
> What is the command-line you are using to invoke these builds?
>
>  --jason
>
>
>
>
>  On May 12, 2008, at 3:29 AM, gawor@apache.org wrote:
>
>
> > Geronimo Revision: 655356 built with tests included
> >
> > See the full build-1500.log file at
> http://people.apache.org/builds/geronimo/server/binaries/trunk/20080511/build-1500.log
> >
> > Download the binaries from
> http://people.apache.org/builds/geronimo/server/binaries/trunk/20080511
> > [INFO] BUILD SUCCESSFUL
> > [INFO]
> ------------------------------------------------------------------------
> > [INFO] Total time: 34 minutes 32 seconds
> > [INFO] Finished at: Sun May 11 15:37:20 EDT 2008
> > [INFO] Final Memory: 329M/1007M
> > [INFO]
> ------------------------------------------------------------------------
> >
> > TESTSUITE RESULTS (Failures only)
> > =================================
> > See detailed results at
> http://people.apache.org/builds/geronimo/server/testsuite/ResultsSummary.html
> >
> > Assembly: tomcat
> > =================================
> > See the full test.log file at
> http://people.apache.org/builds/geronimo/server/binaries/trunk/20080511/logs-1500-tomcat/test.log
> >
> >
> > [INFO] [selenium:start-server {execution: start}]
> > Launching Selenium Server
> > Waiting for Selenium Server...
> > [INFO] Including display properties from:
> /home/geronimo/geronimo/trunk/testsuite/target/selenium/display.properties
> > [INFO] Redirecting output to:
> /home/geronimo/geronimo/trunk/testsuite/target/selenium/server.log
> > [INFO] User extensions:
> /home/geronimo/geronimo/trunk/testsuite/target/selenium/user-extensions.js
> > Selenium Server started
> > Downloading:
> http://download.java.net/maven/1//woodstox/poms/wstx-asl-3.2.1.pom
> > Downloading:
> http://people.apache.org/repo/m2-incubating-repository//woodstox/wstx-asl/3.2.1/wstx-asl-3.2.1.pom
> > Downloading:
> http://repo1.maven.org/maven2/woodstox/wstx-asl/3.2.1/wstx-asl-3.2.1.pom
> > Downloading:
> http://download.java.net/maven/1//woodstox/poms/wstx-asl-3.2.1.pom
> > Downloading:
> http://people.apache.org/repo/m2-incubating-repository//woodstox/wstx-asl/3.2.1/wstx-asl-3.2.1.pom
> > Downloading:
> http://repo1.maven.org/maven2/woodstox/wstx-asl/3.2.1/wstx-asl-3.2.1.pom
> > [INFO] [geronimo:start-server {execution: start}]
> > [INFO] Using assembly configuration: tomcat
> > [INFO] snapshot
> org.apache.geronimo.assemblies:geronimo-tomcat6-javaee5:2.2-SNAPSHOT:
> checking for updates from apache-snapshots
> > [INFO] snapshot
> org.apache.geronimo.assemblies:geronimo-tomcat6-javaee5:2.2-SNAPSHOT:
> checking for updates from codehaus-snapshots
> > [INFO] snapshot
> org.apache.geronimo.assemblies:geronimo-tomcat6-javaee5:2.2-SNAPSHOT:
> checking for updates from apache.snapshots
> > [INFO] Using assembly artifact:
> org.apache.geronimo.assemblies:geronimo-tomcat6-javaee5:zip:bin:2.2-SNAPSHOT
> > [INFO] Using geronimoHome:
> /home/geronimo/geronimo/trunk/testsuite/target/geronimo-tomcat6-javaee5-2.2-SNAPSHOT
> > [INFO] Installing assembly...
> > [INFO] Expanding:
> /home/geronimo/.m2/repository/org/apache/geronimo/assemblies/geronimo-tomcat6-javaee5/2.2-SNAPSHOT/geronimo-tomcat6-javaee5-2.2-SNAPSHOT-bin.zip
> into /home/geronimo/geronimo/trunk/testsuite/target
> > [INFO] Starting Geronimo server...
> > [INFO] Selected option set: default
> > [INFO] Redirecting output to:
> /home/geronimo/geronimo/trunk/testsuite/target/geronimo-logs/org.apache.geronimo.mavenplugins.geronimo.server.StartServerMojo.log
> > [INFO] Waiting for Geronimo server...
> > [INFO] Geronimo server started in 0:00:38.268
> > [INFO] [shitty:install {execution: default}]
> > [INFO] Installing /home/geronimo/geronimo/trunk/testsuite/pom.xml to
> /home/geronimo/.m2/repository/org/apache/geronimo/testsuite/testsuite/2.2-SNAPSHOT/testsuite-2.2-SNAPSHOT.pom
> > [INFO] [shitty:test {execution: default}]
> > [INFO] Starting 27 test build(s)
> > [INFO]
> > [INFO]
> -------------------------------------------------------------------------------
> > [INFO]
> > [INFO] console-testsuite/advanced               RUNNING
> > [INFO] console-testsuite/advanced               FAILURE (0:01:20.958) Java
> returned: 1
> > [INFO] console-testsuite/basic                  RUNNING
> > [INFO] console-testsuite/basic                  SUCCESS (0:01:37.950)
> > [INFO] corba-testsuite/corba-helloworld         RUNNING
> > [INFO] corba-testsuite/corba-helloworld         SUCCESS (0:00:40.666)
> > [INFO] corba-testsuite/corba-marshal            RUNNING
> > [INFO] corba-testsuite/corba-marshal            SUCCESS (0:00:43.810)
> > [INFO] corba-testsuite/corba-mytime             RUNNING
> > [INFO] corba-testsuite/corba-mytime             SUCCESS (0:00:40.498)
> > [INFO] deployment-testsuite/deployment-tests    RUNNING
> > [INFO] deployment-testsuite/deployment-tests    SUCCESS (0:00:26.796)
> > [INFO] deployment-testsuite/jca-cms-tests       RUNNING
> > [INFO] deployment-testsuite/jca-cms-tests       SUCCESS (0:00:24.299)
> > [INFO] deployment-testsuite/manifestcp-tests    RUNNING
> > [INFO] deployment-testsuite/manifestcp-tests    SUCCESS (0:00:25.317)
> > [INFO] enterprise-testsuite/ejb-tests           RUNNING
> > [INFO] enterprise-testsuite/ejb-tests           SUCCESS (0:00:29.303)
> > [INFO] enterprise-testsuite/jms-tests           RUNNING
> > [INFO] enterprise-testsuite/jms-tests           SUCCESS (0:00:39.050)
> > [INFO] enterprise-testsuite/jpa-tests           RUNNING
> > [INFO] enterprise-testsuite/jpa-tests           SUCCESS (0:00:34.526)
> > [INFO] enterprise-testsuite/sec-client          RUNNING
> > [INFO] enterprise-testsuite/sec-client          SUCCESS (0:00:24.442)
> > [INFO] enterprise-testsuite/sec-tests           RUNNING
> > [INFO] enterprise-testsuite/sec-tests           SUCCESS (0:00:33.711)
> > [INFO] security-testsuite/test-security         RUNNING
> > [INFO] security-testsuite/test-security         SUCCESS (0:00:32.880)
> > [INFO] web-testsuite/test-2.1-jsps              RUNNING
> > [INFO] web-testsuite/test-2.1-jsps              SUCCESS (0:00:31.084)
> > [INFO] web-testsuite/test-2.5-servlets          RUNNING
> > [INFO] web-testsuite/test-2.5-servlets          SUCCESS (0:00:24.130)
> > [INFO] web-testsuite/test-jetty                 RUNNING
> > [INFO] web-testsuite/test-jetty                 FAILURE (0:00:14.008) Java
> returned: 1
> > [INFO] web-testsuite/test-myfaces               RUNNING
> > [INFO] web-testsuite/test-myfaces               SUCCESS (0:00:28.085)
> > [INFO] web-testsuite/test-web-forward           RUNNING
> > [INFO] web-testsuite/test-web-forward           SUCCESS (0:00:27.867)
> > [INFO] web-testsuite/test-web-references        RUNNING
> > [INFO] web-testsuite/test-web-references        SUCCESS (0:00:31.630)
> > [INFO] webservices-testsuite/jaxb-tests         RUNNING
> > [INFO] webservices-testsuite/jaxb-tests         SUCCESS (0:00:41.497)
> > [INFO] webservices-testsuite/jaxr-tests         RUNNING
> > [INFO] webservices-testsuite/jaxr-tests         SUCCESS (0:00:40.404)
> > [INFO] webservices-testsuite/jaxrpc-jaxws-tests RUNNING
> > [INFO] webservices-testsuite/jaxrpc-jaxws-tests SUCCESS (0:00:27.970)
> > [INFO] webservices-testsuite/jaxrpc-tests       RUNNING
> > [INFO] webservices-testsuite/jaxrpc-tests       SUCCESS (0:00:30.270)
> > [INFO] webservices-testsuite/jaxws-tests        RUNNING
> > [INFO] webservices-testsuite/jaxws-tests        SUCCESS (0:01:03.625)
> > [INFO] webservices-testsuite/saaj-tests         RUNNING
> > [INFO] webservices-testsuite/saaj-tests         SUCCESS (0:00:31.306)
> > [INFO] webservices-testsuite/stax-tests         RUNNING
> > [INFO] webservices-testsuite/stax-tests         SUCCESS (0:00:42.161)
> > [INFO]
> > [INFO]
> -------------------------------------------------------------------------------
> > [INFO] Test Summary (0:16:48.417)
> > [INFO]     Passed: 25
> > [INFO]     Failed: 2
> > [INFO]
> -------------------------------------------------------------------------------
> > [INFO]
> > [INFO] The following tests failed:
> > [INFO]     * console-testsuite/advanced -
> /home/geronimo/geronimo/trunk/testsuite/console-testsuite/advanced/build.log
> > [INFO]     * web-testsuite/test-jetty -
> /home/geronimo/geronimo/trunk/testsuite/web-testsuite/test-jetty/build.log
> > [INFO]
> > [INFO]
> ------------------------------------------------------------------------
> > [ERROR] BUILD ERROR
> >
> > Assembly: jetty
> > =================================
> > See the full test.log file at
> http://people.apache.org/builds/geronimo/server/binaries/trunk/20080511/logs-1500-jetty/test.log
> >
> >
> > [INFO] [site:attach-descriptor]
> > [INFO] [selenium:start-server {execution: start}]
> > Launching Selenium Server
> > Waiting for Selenium Server...
> > [INFO] Including display properties from:
> /home/geronimo/geronimo/trunk/testsuite/target/selenium/display.properties
> > [INFO] Redirecting output to:
> /home/geronimo/geronimo/trunk/testsuite/target/selenium/server.log
> > [INFO] User extensions:
> /home/geronimo/geronimo/trunk/testsuite/target/selenium/user-extensions.js
> > Selenium Server started
> > Downloading:
> http://download.java.net/maven/1//woodstox/poms/wstx-asl-3.2.1.pom
> > Downloading:
> http://people.apache.org/repo/m2-incubating-repository//woodstox/wstx-asl/3.2.1/wstx-asl-3.2.1.pom
> > Downloading:
> http://repo1.maven.org/maven2/woodstox/wstx-asl/3.2.1/wstx-asl-3.2.1.pom
> > Downloading:
> http://download.java.net/maven/1//woodstox/poms/wstx-asl-3.2.1.pom
> > Downloading:
> http://people.apache.org/repo/m2-incubating-repository//woodstox/wstx-asl/3.2.1/wstx-asl-3.2.1.pom
> > Downloading:
> http://repo1.maven.org/maven2/woodstox/wstx-asl/3.2.1/wstx-asl-3.2.1.pom
> > [INFO] [geronimo:start-server {execution: start}]
> > [INFO] Using assembly configuration: jetty
> > [INFO] snapshot
> org.apache.geronimo.assemblies:geronimo-jetty6-javaee5:2.2-SNAPSHOT:
> checking for updates from apache-snapshots
> > [INFO] snapshot
> org.apache.geronimo.assemblies:geronimo-jetty6-javaee5:2.2-SNAPSHOT:
> checking for updates from codehaus-snapshots
> > [INFO] snapshot
> org.apache.geronimo.assemblies:geronimo-jetty6-javaee5:2.2-SNAPSHOT:
> checking for updates from apache.snapshots
> > [INFO] Using assembly artifact:
> org.apache.geronimo.assemblies:geronimo-jetty6-javaee5:zip:bin:2.2-SNAPSHOT
> > [INFO] Using geronimoHome:
> /home/geronimo/geronimo/trunk/testsuite/target/geronimo-jetty6-javaee5-2.2-SNAPSHOT
> > [INFO] Installing assembly...
> > [INFO] Expanding:
> /home/geronimo/.m2/repository/org/apache/geronimo/assemblies/geronimo-jetty6-javaee5/2.2-SNAPSHOT/geronimo-jetty6-javaee5-2.2-SNAPSHOT-bin.zip
> into /home/geronimo/geronimo/trunk/testsuite/target
> > [INFO] Starting Geronimo server...
> > [INFO] Selected option set: default
> > [INFO] Redirecting output to:
> /home/geronimo/geronimo/trunk/testsuite/target/geronimo-logs/org.apache.geronimo.mavenplugins.geronimo.server.StartServerMojo.log
> > [INFO] Waiting for Geronimo server...
> > [INFO] Geronimo server started in 0:00:38.829
> > [INFO] [shitty:install {execution: default}]
> > [INFO] Installing /home/geronimo/geronimo/trunk/testsuite/pom.xml to
> /home/geronimo/.m2/repository/org/apache/geronimo/testsuite/testsuite/2.2-SNAPSHOT/testsuite-2.2-SNAPSHOT.pom
> > [INFO] [shitty:test {execution: default}]
> > [INFO] Starting 27 test build(s)
> > [INFO]
> > [INFO]
> -------------------------------------------------------------------------------
> > [INFO]
> > [INFO] console-testsuite/advanced               RUNNING
> > [INFO] console-testsuite/advanced               FAILURE (0:01:18.433) Java
> returned: 1
> > [INFO] console-testsuite/basic                  RUNNING
> > [INFO] console-testsuite/basic                  SUCCESS (0:01:45.361)
> > [INFO] corba-testsuite/corba-helloworld         RUNNING
> > [INFO] corba-testsuite/corba-helloworld         SUCCESS (0:00:40.024)
> > [INFO] corba-testsuite/corba-marshal            RUNNING
> > [INFO] corba-testsuite/corba-marshal            SUCCESS (0:00:51.191)
> > [INFO] corba-testsuite/corba-mytime             RUNNING
> > [INFO] corba-testsuite/corba-mytime             SUCCESS (0:00:38.677)
> > [INFO] deployment-testsuite/deployment-tests    RUNNING
> > [INFO] deployment-testsuite/deployment-tests    SUCCESS (0:00:28.972)
> > [INFO] deployment-testsuite/jca-cms-tests       RUNNING
> > [INFO] deployment-testsuite/jca-cms-tests       SUCCESS (0:00:24.725)
> > [INFO] deployment-testsuite/manifestcp-tests    RUNNING
> > [INFO] deployment-testsuite/manifestcp-tests    SUCCESS (0:00:26.268)
> > [INFO] enterprise-testsuite/ejb-tests           RUNNING
> > [INFO] enterprise-testsuite/ejb-tests           SUCCESS (0:00:27.454)
> > [INFO] enterprise-testsuite/jms-tests           RUNNING
> > [INFO] enterprise-testsuite/jms-tests           SUCCESS (0:00:39.718)
> > [INFO] enterprise-testsuite/jpa-tests           RUNNING
> > [INFO] enterprise-testsuite/jpa-tests           SUCCESS (0:00:33.610)
> > [INFO] enterprise-testsuite/sec-client          RUNNING
> > [INFO] enterprise-testsuite/sec-client          SUCCESS (0:00:23.659)
> > [INFO] enterprise-testsuite/sec-tests           RUNNING
> > [INFO] enterprise-testsuite/sec-tests           SUCCESS (0:00:34.630)
> > [INFO] security-testsuite/test-security         RUNNING
> > [INFO] security-testsuite/test-security         SUCCESS (0:00:33.176)
> > [INFO] web-testsuite/test-2.1-jsps              RUNNING
> > [INFO] web-testsuite/test-2.1-jsps              SUCCESS (0:00:30.020)
> > [INFO] web-testsuite/test-2.5-servlets          RUNNING
> > [INFO] web-testsuite/test-2.5-servlets          SUCCESS (0:00:23.647)
> > [INFO] web-testsuite/test-jetty                 RUNNING
> > [INFO] web-testsuite/test-jetty                 SUCCESS (0:00:17.273)
> > [INFO] web-testsuite/test-myfaces               RUNNING
> > [INFO] web-testsuite/test-myfaces               SUCCESS (0:00:28.669)
> > [INFO] web-testsuite/test-web-forward           RUNNING
> > [INFO] web-testsuite/test-web-forward           SUCCESS (0:00:29.190)
> > [INFO] web-testsuite/test-web-references        RUNNING
> > [INFO] web-testsuite/test-web-references        SUCCESS (0:00:33.838)
> > [INFO] webservices-testsuite/jaxb-tests         RUNNING
> > [INFO] webservices-testsuite/jaxb-tests         SUCCESS (0:00:43.955)
> > [INFO] webservices-testsuite/jaxr-tests         RUNNING
> > [INFO] webservices-testsuite/jaxr-tests         SUCCESS (0:00:42.080)
> > [INFO] webservices-testsuite/jaxrpc-jaxws-tests RUNNING
> > [INFO] webservices-testsuite/jaxrpc-jaxws-tests SUCCESS (0:00:24.119)
> > [INFO] webservices-testsuite/jaxrpc-tests       RUNNING
> > [INFO] webservices-testsuite/jaxrpc-tests       SUCCESS (0:00:31.800)
> > [INFO] webservices-testsuite/jaxws-tests        RUNNING
> > [INFO] webservices-testsuite/jaxws-tests        SUCCESS (0:01:00.896)
> > [INFO] webservices-testsuite/saaj-tests         RUNNING
> > [INFO] webservices-testsuite/saaj-tests         SUCCESS (0:00:34.224)
> > [INFO] webservices-testsuite/stax-tests         RUNNING
> > [INFO] webservices-testsuite/stax-tests         SUCCESS (0:00:42.963)
> > [INFO]
> > [INFO]
> -------------------------------------------------------------------------------
> > [INFO] Test Summary (0:17:08.742)
> > [INFO]     Passed: 26
> > [INFO]     Failed: 1
> > [INFO]
> -------------------------------------------------------------------------------
> > [INFO]
> > [INFO] The following tests failed:
> > [INFO]     * console-testsuite/advanced -
> /home/geronimo/geronimo/trunk/testsuite/console-testsuite/advanced/build.log
> > [INFO]
> > [INFO]
> ------------------------------------------------------------------------
> > [ERROR] BUILD ERROR
> >
> > Samples: trunk
> > =================================
> > Log:
> http://people.apache.org/builds/geronimo/server/binaries/trunk/20080511/samples-1500.log
> >
> > Build status: OK
> >
> >
>
>

Mime
View raw message