geronimo-dev mailing list archives

Site index · List index
Message view « Date » · « Thread »
Top « Date » · « Thread »
From ga...@apache.org
Subject [BUILD] branches/2.1: Failed for Revision: 661026
Date Wed, 28 May 2008 19:15:26 GMT
Geronimo Revision: 661026 built with tests included
 
See the full build-1400.log file at http://people.apache.org/builds/geronimo/server/binaries/2.1/20080528/build-1400.log
 
Download the binaries from http://people.apache.org/builds/geronimo/server/binaries/2.1/20080528
[INFO] BUILD SUCCESSFUL
[INFO] ------------------------------------------------------------------------
[INFO] Total time: 31 minutes 35 seconds
[INFO] Finished at: Wed May 28 14:35:55 EDT 2008
[INFO] Final Memory: 305M/1012M
[INFO] ------------------------------------------------------------------------
 
TESTSUITE RESULTS (Failures only)
=================================
See detailed results at http://people.apache.org/builds/geronimo/server/testsuite/ResultsSummary.html
 
Assembly: tomcat
=================================
See the full test.log file at http://people.apache.org/builds/geronimo/server/binaries/2.1/20080528/logs-1400-tomcat/test.log
 
 
[INFO] [INFO] [ear:ear]
[INFO] [INFO] Copying artifact[war:org.apache.geronimo.testsuite:sec-war:2.1.2-SNAPSHOT] to[web.war]
[INFO] [INFO] Copying artifact[ejb:org.apache.geronimo.testsuite:sec-ejb:2.1.2-SNAPSHOT] to[ejb.jar]
[INFO] [INFO] Copy ear resources to /home/geronimo/geronimo/2.1/testsuite/enterprise-testsuite/sec-tests/sec-ear/target/sec-ear-2.1.2-SNAPSHOT
[INFO] [INFO] Could not find manifest file: /home/geronimo/geronimo/2.1/testsuite/enterprise-testsuite/sec-tests/sec-ear/src/main/application/META-INF/MANIFEST.MF
- Generating one
[INFO] [INFO] Building jar: /home/geronimo/geronimo/2.1/testsuite/enterprise-testsuite/sec-tests/sec-ear/target/sec-ear-2.1.2-SNAPSHOT.ear
[INFO] [INFO] [selenium:start-server {execution: start-server}]
[INFO] [INFO] Starting Selenium server...
[INFO] [INFO] Created dir: /home/geronimo/geronimo/2.1/testsuite/enterprise-testsuite/sec-tests/sec-ear/target/selenium
[INFO] Launching Selenium Server
[INFO] Waiting for Selenium Server...
[INFO] Selenium Server started
[INFO] [WARNING] OS appears to be Unix and no DISPLAY environment variable has been detected.
Browser maybe unable to function correctly. Consider using the selenium:xvfb goal to enable
headless operation.
[INFO] [INFO] Redirecting output to: /home/geronimo/geronimo/2.1/testsuite/enterprise-testsuite/sec-tests/sec-ear/target/selenium/server.log
[INFO] [INFO] User extensions: /home/geronimo/geronimo/2.1/testsuite/enterprise-testsuite/sec-tests/sec-ear/target/selenium/user-extensions.js
[INFO] [INFO] [geronimo:deploy-module {execution: deploy}]
[INFO] [INFO] Using non-artifact based module archive: /home/geronimo/geronimo/2.1/testsuite/enterprise-testsuite/sec-tests/sec-ear/target/sec-ear-2.1.2-SNAPSHOT.ear
[INFO] [INFO] Distributing module artifact: /home/geronimo/geronimo/2.1/testsuite/enterprise-testsuite/sec-tests/sec-ear/target/sec-ear-2.1.2-SNAPSHOT.ear
[WARNING] log4j:WARN No appenders could be found for logger (org.apache.geronimo.deployment.plugin.factories.BaseDeploymentFactory).
[WARNING] log4j:WARN Please initialize the log4j system properly.
[INFO] [INFO] Starting modules...
[INFO] [INFO] Starting module: org.apache.geronimo.testsuite/sec-ear/2.1.2-SNAPSHOT/ear
[INFO] [INFO] Started module(s):
[INFO] [INFO]     [0] org.apache.geronimo.testsuite/sec-ear/2.1.2-SNAPSHOT/ear
[INFO] [INFO] [surefire:test {execution: integration}]
[INFO] [INFO] Surefire report directory: /home/geronimo/geronimo/2.1/testsuite/enterprise-testsuite/sec-tests/sec-ear/target/surefire-reports
[INFO] 
[INFO] -------------------------------------------------------
[INFO]  T E S T S
[INFO] -------------------------------------------------------
[INFO] Running sec-testsuite.security
[INFO] Tests run: 2, Failures: 0, Errors: 0, Skipped: 0, Time elapsed: 0.677 sec
[INFO] 
[INFO] Results :
[INFO] 
[INFO] Tests run: 2, Failures: 0, Errors: 0, Skipped: 0
[INFO] 
[INFO] [INFO] [geronimo:undeploy-module {execution: undeploy}]
[INFO] [INFO] Using non-artifact based module id: org.apache.geronimo.testsuite/sec-ear/2.1.2-SNAPSHOT/ear
[INFO] [INFO] Stopping module: org.apache.geronimo.testsuite/sec-ear/2.1.2-SNAPSHOT/ear
[INFO] [INFO] Stopped module(s):
[INFO] [INFO]     [0] org.apache.geronimo.testsuite/sec-ear/2.1.2-SNAPSHOT/ear
[INFO] [INFO]         [0] web.war; URL: /sec
[INFO] [INFO]         [1] ejb.jar
[INFO] [INFO] Undeploying module: org.apache.geronimo.testsuite/sec-ear/2.1.2-SNAPSHOT/ear
[INFO] [INFO] Undeployed module(s):
[INFO] [INFO]     [0] org.apache.geronimo.testsuite/sec-ear/2.1.2-SNAPSHOT/ear
[INFO] [INFO] [tools:verify-legal-files {execution: verify-legal-files}]
[INFO] [INFO] Checking legal files in: sec-ear-2.1.2-SNAPSHOT.ear
[INFO] [INFO] [install:install]
[INFO] [INFO] Installing /home/geronimo/geronimo/2.1/testsuite/enterprise-testsuite/sec-tests/sec-ear/target/sec-ear-2.1.2-SNAPSHOT.ear
to /home/geronimo/.m2/repository/org/apache/geronimo/testsuite/sec-ear/2.1.2-SNAPSHOT/sec-ear-2.1.2-SNAPSHOT.ear
[INFO] [INFO] [testsuite:generate-surefire-xml {execution: generate-surefire-xml}]
[INFO] [INFO] Updating directory: /home/geronimo/geronimo/2.1/testsuite/enterprise-testsuite/target/surefire-reports
[INFO] [INFO] Loading surefire xml for xmlproperty: /home/geronimo/geronimo/2.1/testsuite/enterprise-testsuite/sec-tests/sec-ear/target/surefire-reports/TEST-org.apache.geronimo.mavenplugins.geronimo.module.DeployModuleMojo.xml
[INFO] [INFO] Loading surefire xml for xmlproperty: /home/geronimo/geronimo/2.1/testsuite/enterprise-testsuite/sec-tests/sec-ear/target/surefire-reports/TEST-org.apache.geronimo.mavenplugins.geronimo.module.UndeployModuleMojo.xml
[INFO] [INFO] Loading parent surefire xml for xmlproperty: /home/geronimo/geronimo/2.1/testsuite/enterprise-testsuite/target/surefire-reports/TEST-sec-ear.xml
[INFO] [INFO] Loading surefire xml for xmlproperty: /home/geronimo/geronimo/2.1/testsuite/enterprise-testsuite/sec-tests/sec-ear/target/surefire-reports/TEST-sec-testsuite.security.xml
[INFO] [INFO] Loading parent surefire xml for xmlproperty: /home/geronimo/geronimo/2.1/testsuite/enterprise-testsuite/target/surefire-reports/TEST-sec-ear.xml
[INFO] [INFO] 
[INFO] [INFO] 
[INFO] [INFO] ------------------------------------------------------------------------
[INFO] [INFO] Reactor Summary:
[INFO] [INFO] ------------------------------------------------------------------------
[INFO] [INFO] Geronimo TestSuite :: Enterprise Testsuite :: Security Tests  SUCCESS [3.889s]
[INFO] [INFO] Geronimo TestSuite :: Enterprise Testsuite :: Security - JAR  SUCCESS [4.417s]
[INFO] [INFO] Geronimo TestSuite :: Enterprise Testsuite :: Security - WAR  SUCCESS [2.124s]
[INFO] [INFO] Geronimo TestSuite :: Enterprise Testsuite :: Security - EAR  SUCCESS [24.360s]
[INFO] [INFO] ------------------------------------------------------------------------
[INFO] [INFO] ------------------------------------------------------------------------
[INFO] [INFO] BUILD SUCCESSFUL
[INFO] [INFO] ------------------------------------------------------------------------
[INFO] [INFO] Total time: 36 seconds
[INFO] [INFO] Finished at: Wed May 28 14:54:24 EDT 2008
[INFO] [INFO] Final Memory: 35M/562M
[INFO] [INFO] ------------------------------------------------------------------------
[INFO] [tools:verify-legal-files {execution: verify-legal-files}]
[INFO] [install:install]
[INFO] Installing /home/geronimo/geronimo/2.1/testsuite/enterprise-testsuite/pom.xml to /home/geronimo/.m2/repository/org/apache/geronimo/testsuite/enterprise-testsuite/2.1.2-SNAPSHOT/enterprise-testsuite-2.1.2-SNAPSHOT.pom
[INFO] [testsuite:generate-surefire-xml {execution: generate-surefire-xml}]
[INFO] Updating directory: /home/geronimo/geronimo/2.1/testsuite/target/surefire-reports
[INFO] Loading surefire xml for xmlproperty: /home/geronimo/geronimo/2.1/testsuite/enterprise-testsuite/target/surefire-reports/TEST-jpa-ear.xml
[INFO] Loading surefire xml for xmlproperty: /home/geronimo/geronimo/2.1/testsuite/enterprise-testsuite/target/surefire-reports/TEST-ejb-ear.xml
[INFO] Loading parent surefire xml for xmlproperty: /home/geronimo/geronimo/2.1/testsuite/target/surefire-reports/TEST-enterprise-testsuite.xml
[INFO] Loading surefire xml for xmlproperty: /home/geronimo/geronimo/2.1/testsuite/enterprise-testsuite/target/surefire-reports/TEST-jms-ear.xml
[INFO] Loading parent surefire xml for xmlproperty: /home/geronimo/geronimo/2.1/testsuite/target/surefire-reports/TEST-enterprise-testsuite.xml
[INFO] Loading surefire xml for xmlproperty: /home/geronimo/geronimo/2.1/testsuite/enterprise-testsuite/target/surefire-reports/TEST-org.apache.geronimo.mavenplugins.geronimo.server.StartServerMojo.xml
[INFO] Loading parent surefire xml for xmlproperty: /home/geronimo/geronimo/2.1/testsuite/target/surefire-reports/TEST-enterprise-testsuite.xml
[INFO] Loading surefire xml for xmlproperty: /home/geronimo/geronimo/2.1/testsuite/enterprise-testsuite/target/surefire-reports/TEST-sec-ear.xml
[INFO] Loading parent surefire xml for xmlproperty: /home/geronimo/geronimo/2.1/testsuite/target/surefire-reports/TEST-enterprise-testsuite.xml
[INFO] [geronimo:stop-server {execution: stop-server}]
[INFO] Stopping Geronimo server...
[INFO] ----------------------------------------------------------------------------
[INFO] Building Geronimo TestSuite :: Web-tier Testsuite
[INFO]    task-segment: [install]
[INFO] ----------------------------------------------------------------------------
[INFO] [enforcer:enforce {execution: default}]
[INFO] [tools:copy-legal-files {execution: install-legal-files}]
[INFO] [selenium:xvfb {execution: xvfb}]
[INFO] Starting Xvfb...
[INFO] ------------------------------------------------------------------------
[ERROR] BUILD ERROR
 
Assembly: jetty
=================================
See the full test.log file at http://people.apache.org/builds/geronimo/server/binaries/2.1/20080528/logs-1400-jetty/test.log
 
[INFO] Running console-testsuite.advance-test
[INFO] Tests run: 13, Failures: 1, Errors: 0, Skipped: 0, Time elapsed: 76.538 sec <<<
FAILURE!
 
[INFO] [INFO] [ear:ear]
[INFO] [INFO] Copying artifact[war:org.apache.geronimo.testsuite:sec-war:2.1.2-SNAPSHOT] to[web.war]
[INFO] [INFO] Copying artifact[ejb:org.apache.geronimo.testsuite:sec-ejb:2.1.2-SNAPSHOT] to[ejb.jar]
[INFO] [INFO] Copy ear resources to /home/geronimo/geronimo/2.1/testsuite/enterprise-testsuite/sec-tests/sec-ear/target/sec-ear-2.1.2-SNAPSHOT
[INFO] [INFO] Could not find manifest file: /home/geronimo/geronimo/2.1/testsuite/enterprise-testsuite/sec-tests/sec-ear/src/main/application/META-INF/MANIFEST.MF
- Generating one
[INFO] [INFO] Building jar: /home/geronimo/geronimo/2.1/testsuite/enterprise-testsuite/sec-tests/sec-ear/target/sec-ear-2.1.2-SNAPSHOT.ear
[INFO] [INFO] [selenium:start-server {execution: start-server}]
[INFO] [INFO] Starting Selenium server...
[INFO] [INFO] Created dir: /home/geronimo/geronimo/2.1/testsuite/enterprise-testsuite/sec-tests/sec-ear/target/selenium
[INFO] Launching Selenium Server
[INFO] Waiting for Selenium Server...
[INFO] Selenium Server started
[INFO] [WARNING] OS appears to be Unix and no DISPLAY environment variable has been detected.
Browser maybe unable to function correctly. Consider using the selenium:xvfb goal to enable
headless operation.
[INFO] [INFO] Redirecting output to: /home/geronimo/geronimo/2.1/testsuite/enterprise-testsuite/sec-tests/sec-ear/target/selenium/server.log
[INFO] [INFO] User extensions: /home/geronimo/geronimo/2.1/testsuite/enterprise-testsuite/sec-tests/sec-ear/target/selenium/user-extensions.js
[INFO] [INFO] [geronimo:deploy-module {execution: deploy}]
[INFO] [INFO] Using non-artifact based module archive: /home/geronimo/geronimo/2.1/testsuite/enterprise-testsuite/sec-tests/sec-ear/target/sec-ear-2.1.2-SNAPSHOT.ear
[INFO] [INFO] Distributing module artifact: /home/geronimo/geronimo/2.1/testsuite/enterprise-testsuite/sec-tests/sec-ear/target/sec-ear-2.1.2-SNAPSHOT.ear
[WARNING] log4j:WARN No appenders could be found for logger (org.apache.geronimo.deployment.plugin.factories.BaseDeploymentFactory).
[WARNING] log4j:WARN Please initialize the log4j system properly.
[INFO] [INFO] Starting modules...
[INFO] [INFO] Starting module: org.apache.geronimo.testsuite/sec-ear/2.1.2-SNAPSHOT/ear
[INFO] [INFO] Started module(s):
[INFO] [INFO]     [0] org.apache.geronimo.testsuite/sec-ear/2.1.2-SNAPSHOT/ear
[INFO] [INFO] [surefire:test {execution: integration}]
[INFO] [INFO] Surefire report directory: /home/geronimo/geronimo/2.1/testsuite/enterprise-testsuite/sec-tests/sec-ear/target/surefire-reports
[INFO] 
[INFO] -------------------------------------------------------
[INFO]  T E S T S
[INFO] -------------------------------------------------------
[INFO] Running sec-testsuite.security
[INFO] Tests run: 2, Failures: 0, Errors: 0, Skipped: 0, Time elapsed: 4.858 sec
[INFO] 
[INFO] Results :
[INFO] 
[INFO] Tests run: 2, Failures: 0, Errors: 0, Skipped: 0
[INFO] 
[INFO] [INFO] [geronimo:undeploy-module {execution: undeploy}]
[INFO] [INFO] Using non-artifact based module id: org.apache.geronimo.testsuite/sec-ear/2.1.2-SNAPSHOT/ear
[INFO] [INFO] Stopping module: org.apache.geronimo.testsuite/sec-ear/2.1.2-SNAPSHOT/ear
[INFO] [INFO] Stopped module(s):
[INFO] [INFO]     [0] org.apache.geronimo.testsuite/sec-ear/2.1.2-SNAPSHOT/ear
[INFO] [INFO]         [0] web.war; URL: /sec
[INFO] [INFO]         [1] ejb.jar
[INFO] [INFO] Undeploying module: org.apache.geronimo.testsuite/sec-ear/2.1.2-SNAPSHOT/ear
[INFO] [INFO] Undeployed module(s):
[INFO] [INFO]     [0] org.apache.geronimo.testsuite/sec-ear/2.1.2-SNAPSHOT/ear
[INFO] [INFO] [tools:verify-legal-files {execution: verify-legal-files}]
[INFO] [INFO] Checking legal files in: sec-ear-2.1.2-SNAPSHOT.ear
[INFO] [INFO] [install:install]
[INFO] [INFO] Installing /home/geronimo/geronimo/2.1/testsuite/enterprise-testsuite/sec-tests/sec-ear/target/sec-ear-2.1.2-SNAPSHOT.ear
to /home/geronimo/.m2/repository/org/apache/geronimo/testsuite/sec-ear/2.1.2-SNAPSHOT/sec-ear-2.1.2-SNAPSHOT.ear
[INFO] [INFO] [testsuite:generate-surefire-xml {execution: generate-surefire-xml}]
[INFO] [INFO] Updating directory: /home/geronimo/geronimo/2.1/testsuite/enterprise-testsuite/target/surefire-reports
[INFO] [INFO] Loading surefire xml for xmlproperty: /home/geronimo/geronimo/2.1/testsuite/enterprise-testsuite/sec-tests/sec-ear/target/surefire-reports/TEST-org.apache.geronimo.mavenplugins.geronimo.module.DeployModuleMojo.xml
[INFO] [INFO] Loading surefire xml for xmlproperty: /home/geronimo/geronimo/2.1/testsuite/enterprise-testsuite/sec-tests/sec-ear/target/surefire-reports/TEST-org.apache.geronimo.mavenplugins.geronimo.module.UndeployModuleMojo.xml
[INFO] [INFO] Loading parent surefire xml for xmlproperty: /home/geronimo/geronimo/2.1/testsuite/enterprise-testsuite/target/surefire-reports/TEST-sec-ear.xml
[INFO] [INFO] Loading surefire xml for xmlproperty: /home/geronimo/geronimo/2.1/testsuite/enterprise-testsuite/sec-tests/sec-ear/target/surefire-reports/TEST-sec-testsuite.security.xml
[INFO] [INFO] Loading parent surefire xml for xmlproperty: /home/geronimo/geronimo/2.1/testsuite/enterprise-testsuite/target/surefire-reports/TEST-sec-ear.xml
[INFO] [INFO] 
[INFO] [INFO] 
[INFO] [INFO] ------------------------------------------------------------------------
[INFO] [INFO] Reactor Summary:
[INFO] [INFO] ------------------------------------------------------------------------
[INFO] [INFO] Geronimo TestSuite :: Enterprise Testsuite :: Security Tests  SUCCESS [4.244s]
[INFO] [INFO] Geronimo TestSuite :: Enterprise Testsuite :: Security - JAR  SUCCESS [3.767s]
[INFO] [INFO] Geronimo TestSuite :: Enterprise Testsuite :: Security - WAR  SUCCESS [1.235s]
[INFO] [INFO] Geronimo TestSuite :: Enterprise Testsuite :: Security - EAR  SUCCESS [24.546s]
[INFO] [INFO] ------------------------------------------------------------------------
[INFO] [INFO] ------------------------------------------------------------------------
[INFO] [INFO] BUILD SUCCESSFUL
[INFO] [INFO] ------------------------------------------------------------------------
[INFO] [INFO] Total time: 35 seconds
[INFO] [INFO] Finished at: Wed May 28 15:22:37 EDT 2008
[INFO] [INFO] Final Memory: 35M/562M
[INFO] [INFO] ------------------------------------------------------------------------
[INFO] [tools:verify-legal-files {execution: verify-legal-files}]
[INFO] [install:install]
[INFO] Installing /home/geronimo/geronimo/2.1/testsuite/enterprise-testsuite/pom.xml to /home/geronimo/.m2/repository/org/apache/geronimo/testsuite/enterprise-testsuite/2.1.2-SNAPSHOT/enterprise-testsuite-2.1.2-SNAPSHOT.pom
[INFO] [testsuite:generate-surefire-xml {execution: generate-surefire-xml}]
[INFO] Updating directory: /home/geronimo/geronimo/2.1/testsuite/target/surefire-reports
[INFO] Loading surefire xml for xmlproperty: /home/geronimo/geronimo/2.1/testsuite/enterprise-testsuite/target/surefire-reports/TEST-jpa-ear.xml
[INFO] Loading surefire xml for xmlproperty: /home/geronimo/geronimo/2.1/testsuite/enterprise-testsuite/target/surefire-reports/TEST-ejb-ear.xml
[INFO] Loading parent surefire xml for xmlproperty: /home/geronimo/geronimo/2.1/testsuite/target/surefire-reports/TEST-enterprise-testsuite.xml
[INFO] Loading surefire xml for xmlproperty: /home/geronimo/geronimo/2.1/testsuite/enterprise-testsuite/target/surefire-reports/TEST-jms-ear.xml
[INFO] Loading parent surefire xml for xmlproperty: /home/geronimo/geronimo/2.1/testsuite/target/surefire-reports/TEST-enterprise-testsuite.xml
[INFO] Loading surefire xml for xmlproperty: /home/geronimo/geronimo/2.1/testsuite/enterprise-testsuite/target/surefire-reports/TEST-org.apache.geronimo.mavenplugins.geronimo.server.StartServerMojo.xml
[INFO] Loading parent surefire xml for xmlproperty: /home/geronimo/geronimo/2.1/testsuite/target/surefire-reports/TEST-enterprise-testsuite.xml
[INFO] Loading surefire xml for xmlproperty: /home/geronimo/geronimo/2.1/testsuite/enterprise-testsuite/target/surefire-reports/TEST-sec-ear.xml
[INFO] Loading parent surefire xml for xmlproperty: /home/geronimo/geronimo/2.1/testsuite/target/surefire-reports/TEST-enterprise-testsuite.xml
[INFO] [geronimo:stop-server {execution: stop-server}]
[INFO] Stopping Geronimo server...
[INFO] ----------------------------------------------------------------------------
[INFO] Building Geronimo TestSuite :: Web-tier Testsuite
[INFO]    task-segment: [install]
[INFO] ----------------------------------------------------------------------------
[INFO] [enforcer:enforce {execution: default}]
[INFO] [tools:copy-legal-files {execution: install-legal-files}]
[INFO] [selenium:xvfb {execution: xvfb}]
[INFO] Starting Xvfb...
[INFO] ------------------------------------------------------------------------
[ERROR] BUILD ERROR
 
Samples: branches/2.1
=================================
Log: http://people.apache.org/builds/geronimo/server/binaries/2.1/20080528/samples-1400.log
 
Build status: FAILED
 

Mime
View raw message