geronimo-dev mailing list archives

Site index · List index
Message view « Date » · « Thread »
Top « Date » · « Thread »
From ga...@apache.org
Subject [BUILD] trunk: Failed for Revision: 658962
Date Thu, 22 May 2008 02:37:26 GMT
Geronimo Revision: 658962 built with tests included
 
See the full build-2100.log file at http://people.apache.org/builds/geronimo/server/binaries/trunk/20080521/build-2100.log
 
Download the binaries from http://people.apache.org/builds/geronimo/server/binaries/trunk/20080521
[INFO] BUILD SUCCESSFUL
[INFO] ------------------------------------------------------------------------
[INFO] Total time: 31 minutes 5 seconds
[INFO] Finished at: Wed May 21 21:38:22 EDT 2008
[INFO] Final Memory: 386M/1003M
[INFO] ------------------------------------------------------------------------
 
TESTSUITE RESULTS (Failures only)
=================================
See detailed results at http://people.apache.org/builds/geronimo/server/testsuite/ResultsSummary.html
 
Assembly: tomcat
=================================
See the full test.log file at http://people.apache.org/builds/geronimo/server/binaries/trunk/20080521/logs-2100-tomcat/test.log
 
 
[INFO] [site:attach-descriptor]
[INFO] [selenium:start-server {execution: start}]
Launching Selenium Server
Waiting for Selenium Server...
[INFO] Including display properties from: /home/geronimo/geronimo/trunk/testsuite/target/selenium/display.properties
[INFO] Redirecting output to: /home/geronimo/geronimo/trunk/testsuite/target/selenium/server.log
[INFO] User extensions: /home/geronimo/geronimo/trunk/testsuite/target/selenium/user-extensions.js
Selenium Server started
Downloading: http://download.java.net/maven/1//woodstox/poms/wstx-asl-3.2.1.pom
Downloading: http://people.apache.org/repo/m2-incubating-repository//woodstox/wstx-asl/3.2.1/wstx-asl-3.2.1.pom
Downloading: http://repo1.maven.org/maven2/woodstox/wstx-asl/3.2.1/wstx-asl-3.2.1.pom
Downloading: http://download.java.net/maven/1//woodstox/poms/wstx-asl-3.2.1.pom
Downloading: http://people.apache.org/repo/m2-incubating-repository//woodstox/wstx-asl/3.2.1/wstx-asl-3.2.1.pom
Downloading: http://repo1.maven.org/maven2/woodstox/wstx-asl/3.2.1/wstx-asl-3.2.1.pom
[INFO] [geronimo:start-server {execution: start}]
[INFO] Using assembly configuration: tomcat
[INFO] snapshot org.apache.geronimo.assemblies:geronimo-tomcat6-javaee5:2.2-SNAPSHOT: checking
for updates from apache-snapshots
[INFO] snapshot org.apache.geronimo.assemblies:geronimo-tomcat6-javaee5:2.2-SNAPSHOT: checking
for updates from codehaus-snapshots
[INFO] snapshot org.apache.geronimo.assemblies:geronimo-tomcat6-javaee5:2.2-SNAPSHOT: checking
for updates from apache.snapshots
[INFO] Using assembly artifact: org.apache.geronimo.assemblies:geronimo-tomcat6-javaee5:zip:bin:2.2-SNAPSHOT:provided
[INFO] Using geronimoHome: /home/geronimo/geronimo/trunk/testsuite/target/geronimo-tomcat6-javaee5-2.2-SNAPSHOT
[INFO] Installing assembly...
[INFO] Expanding: /home/geronimo/.m2/repository/org/apache/geronimo/assemblies/geronimo-tomcat6-javaee5/2.2-SNAPSHOT/geronimo-tomcat6-javaee5-2.2-SNAPSHOT-bin.zip
into /home/geronimo/geronimo/trunk/testsuite/target
[INFO] Starting Geronimo server...
[INFO] Selected option set: default
[INFO] Redirecting output to: /home/geronimo/geronimo/trunk/testsuite/target/geronimo-logs/org.apache.geronimo.mavenplugins.geronimo.server.StartServerMojo.log
[INFO] Waiting for Geronimo server...
[INFO] Geronimo server started in 0:00:37.448
[INFO] [shitty:install {execution: default}]
[INFO] Installing /home/geronimo/geronimo/trunk/testsuite/pom.xml to /home/geronimo/.m2/repository/org/apache/geronimo/testsuite/testsuite/2.2-SNAPSHOT/testsuite-2.2-SNAPSHOT.pom
[INFO] [shitty:test {execution: default}]
[INFO] Starting 27 test build(s)
[INFO] 
[INFO] -------------------------------------------------------------------------------
[INFO] 
[INFO] console-testsuite/advanced               RUNNING
[INFO] console-testsuite/advanced               SUCCESS (0:01:35.369) 
[INFO] console-testsuite/basic                  RUNNING
[INFO] console-testsuite/basic                  SUCCESS (0:01:39.954) 
[INFO] corba-testsuite/corba-helloworld         RUNNING
[INFO] corba-testsuite/corba-helloworld         SUCCESS (0:00:48.569) 
[INFO] corba-testsuite/corba-marshal            RUNNING
[INFO] corba-testsuite/corba-marshal            SUCCESS (0:00:50.022) 
[INFO] corba-testsuite/corba-mytime             RUNNING
[INFO] corba-testsuite/corba-mytime             SUCCESS (0:00:42.166) 
[INFO] deployment-testsuite/deployment-tests    RUNNING
[INFO] deployment-testsuite/deployment-tests    SUCCESS (0:00:30.129) 
[INFO] deployment-testsuite/jca-cms-tests       RUNNING
[INFO] deployment-testsuite/jca-cms-tests       SUCCESS (0:00:28.907) 
[INFO] deployment-testsuite/manifestcp-tests    RUNNING
[INFO] deployment-testsuite/manifestcp-tests    SUCCESS (0:00:28.593) 
[INFO] enterprise-testsuite/ejb-tests           RUNNING
[INFO] enterprise-testsuite/ejb-tests           SUCCESS (0:00:37.112) 
[INFO] enterprise-testsuite/jms-tests           RUNNING
[INFO] enterprise-testsuite/jms-tests           SUCCESS (0:00:43.970) 
[INFO] enterprise-testsuite/jpa-tests           RUNNING
[INFO] enterprise-testsuite/jpa-tests           SUCCESS (0:00:38.522) 
[INFO] enterprise-testsuite/sec-client          RUNNING
[INFO] enterprise-testsuite/sec-client          SUCCESS (0:00:26.381) 
[INFO] enterprise-testsuite/sec-tests           RUNNING
[INFO] enterprise-testsuite/sec-tests           FAILURE (0:00:43.648) Java returned: 1
[INFO] security-testsuite/test-security         RUNNING
[INFO] security-testsuite/test-security         SUCCESS (0:00:36.776) 
[INFO] web-testsuite/test-2.1-jsps              RUNNING
[INFO] web-testsuite/test-2.1-jsps              SUCCESS (0:00:33.511) 
[INFO] web-testsuite/test-2.5-servlets          RUNNING
[INFO] web-testsuite/test-2.5-servlets          SUCCESS (0:00:26.160) 
[INFO] web-testsuite/test-myfaces               RUNNING
[INFO] web-testsuite/test-myfaces               SUCCESS (0:00:30.141) 
[INFO] web-testsuite/test-tomcat                RUNNING
[INFO] web-testsuite/test-tomcat                SUCCESS (0:00:19.264) 
[INFO] web-testsuite/test-web-forward           RUNNING
[INFO] web-testsuite/test-web-forward           SUCCESS (0:00:31.369) 
[INFO] web-testsuite/test-web-references        RUNNING
[INFO] web-testsuite/test-web-references        SUCCESS (0:00:37.118) 
[INFO] webservices-testsuite/jaxb-tests         RUNNING
[INFO] webservices-testsuite/jaxb-tests         SUCCESS (0:00:46.527) 
[INFO] webservices-testsuite/jaxr-tests         RUNNING
[INFO] webservices-testsuite/jaxr-tests         SUCCESS (0:00:46.597) 
[INFO] webservices-testsuite/jaxrpc-jaxws-tests RUNNING
[INFO] webservices-testsuite/jaxrpc-jaxws-tests SUCCESS (0:00:31.124) 
[INFO] webservices-testsuite/jaxrpc-tests       RUNNING
[INFO] webservices-testsuite/jaxrpc-tests       SUCCESS (0:00:36.769) 
[INFO] webservices-testsuite/jaxws-tests        RUNNING
[INFO] webservices-testsuite/jaxws-tests        SUCCESS (0:01:12.993) 
[INFO] webservices-testsuite/saaj-tests         RUNNING
[INFO] webservices-testsuite/saaj-tests         SUCCESS (0:00:36.451) 
[INFO] webservices-testsuite/stax-tests         RUNNING
[INFO] webservices-testsuite/stax-tests         SUCCESS (0:00:47.915) 
[INFO] 
[INFO] -------------------------------------------------------------------------------
[INFO] Test Summary (0:19:06.242)
[INFO]     Passed: 26
[INFO]     Failed: 1
[INFO] -------------------------------------------------------------------------------
[INFO] 
[INFO] The following tests failed:
[INFO]     * enterprise-testsuite/sec-tests - /home/geronimo/geronimo/trunk/testsuite/enterprise-testsuite/sec-tests/build.log
[INFO] 
[INFO] ------------------------------------------------------------------------
[ERROR] BUILD ERROR
 
Assembly: jetty
=================================
See the full test.log file at http://people.apache.org/builds/geronimo/server/binaries/trunk/20080521/logs-2100-jetty/test.log
 
 
[INFO] [site:attach-descriptor]
[INFO] [selenium:start-server {execution: start}]
Launching Selenium Server
Waiting for Selenium Server...
[INFO] Including display properties from: /home/geronimo/geronimo/trunk/testsuite/target/selenium/display.properties
[INFO] Redirecting output to: /home/geronimo/geronimo/trunk/testsuite/target/selenium/server.log
[INFO] User extensions: /home/geronimo/geronimo/trunk/testsuite/target/selenium/user-extensions.js
Selenium Server started
Downloading: http://download.java.net/maven/1//woodstox/poms/wstx-asl-3.2.1.pom
Downloading: http://people.apache.org/repo/m2-incubating-repository//woodstox/wstx-asl/3.2.1/wstx-asl-3.2.1.pom
Downloading: http://repo1.maven.org/maven2/woodstox/wstx-asl/3.2.1/wstx-asl-3.2.1.pom
Downloading: http://download.java.net/maven/1//woodstox/poms/wstx-asl-3.2.1.pom
Downloading: http://people.apache.org/repo/m2-incubating-repository//woodstox/wstx-asl/3.2.1/wstx-asl-3.2.1.pom
Downloading: http://repo1.maven.org/maven2/woodstox/wstx-asl/3.2.1/wstx-asl-3.2.1.pom
[INFO] [geronimo:start-server {execution: start}]
[INFO] Using assembly configuration: jetty
[INFO] snapshot org.apache.geronimo.assemblies:geronimo-jetty6-javaee5:2.2-SNAPSHOT: checking
for updates from apache-snapshots
[INFO] snapshot org.apache.geronimo.assemblies:geronimo-jetty6-javaee5:2.2-SNAPSHOT: checking
for updates from codehaus-snapshots
[INFO] snapshot org.apache.geronimo.assemblies:geronimo-jetty6-javaee5:2.2-SNAPSHOT: checking
for updates from apache.snapshots
[INFO] Using assembly artifact: org.apache.geronimo.assemblies:geronimo-jetty6-javaee5:zip:bin:2.2-SNAPSHOT:provided
[INFO] Using geronimoHome: /home/geronimo/geronimo/trunk/testsuite/target/geronimo-jetty6-javaee5-2.2-SNAPSHOT
[INFO] Installing assembly...
[INFO] Expanding: /home/geronimo/.m2/repository/org/apache/geronimo/assemblies/geronimo-jetty6-javaee5/2.2-SNAPSHOT/geronimo-jetty6-javaee5-2.2-SNAPSHOT-bin.zip
into /home/geronimo/geronimo/trunk/testsuite/target
[INFO] Starting Geronimo server...
[INFO] Selected option set: default
[INFO] Redirecting output to: /home/geronimo/geronimo/trunk/testsuite/target/geronimo-logs/org.apache.geronimo.mavenplugins.geronimo.server.StartServerMojo.log
[INFO] Waiting for Geronimo server...
[INFO] Geronimo server started in 0:00:39.418
[INFO] [shitty:install {execution: default}]
[INFO] Installing /home/geronimo/geronimo/trunk/testsuite/pom.xml to /home/geronimo/.m2/repository/org/apache/geronimo/testsuite/testsuite/2.2-SNAPSHOT/testsuite-2.2-SNAPSHOT.pom
[INFO] [shitty:test {execution: default}]
[INFO] Starting 27 test build(s)
[INFO] 
[INFO] -------------------------------------------------------------------------------
[INFO] 
[INFO] console-testsuite/advanced               RUNNING
[INFO] console-testsuite/advanced               FAILURE (0:01:18.628) Java returned: 1
[INFO] console-testsuite/basic                  RUNNING
[INFO] console-testsuite/basic                  SUCCESS (0:01:47.253) 
[INFO] corba-testsuite/corba-helloworld         RUNNING
[INFO] corba-testsuite/corba-helloworld         SUCCESS (0:00:46.193) 
[INFO] corba-testsuite/corba-marshal            RUNNING
[INFO] corba-testsuite/corba-marshal            SUCCESS (0:00:48.556) 
[INFO] corba-testsuite/corba-mytime             RUNNING
[INFO] corba-testsuite/corba-mytime             SUCCESS (0:00:43.453) 
[INFO] deployment-testsuite/deployment-tests    RUNNING
[INFO] deployment-testsuite/deployment-tests    SUCCESS (0:00:31.826) 
[INFO] deployment-testsuite/jca-cms-tests       RUNNING
[INFO] deployment-testsuite/jca-cms-tests       SUCCESS (0:00:28.492) 
[INFO] deployment-testsuite/manifestcp-tests    RUNNING
[INFO] deployment-testsuite/manifestcp-tests    SUCCESS (0:00:29.525) 
[INFO] enterprise-testsuite/ejb-tests           RUNNING
[INFO] enterprise-testsuite/ejb-tests           SUCCESS (0:00:31.332) 
[INFO] enterprise-testsuite/jms-tests           RUNNING
[INFO] enterprise-testsuite/jms-tests           SUCCESS (0:00:44.501) 
[INFO] enterprise-testsuite/jpa-tests           RUNNING
[INFO] enterprise-testsuite/jpa-tests           SUCCESS (0:00:39.041) 
[INFO] enterprise-testsuite/sec-client          RUNNING
[INFO] enterprise-testsuite/sec-client          SUCCESS (0:00:28.445) 
[INFO] enterprise-testsuite/sec-tests           RUNNING
[INFO] enterprise-testsuite/sec-tests           SUCCESS (0:00:46.671) 
[INFO] security-testsuite/test-security         RUNNING
[INFO] security-testsuite/test-security         SUCCESS (0:03:45.982) 
[INFO] web-testsuite/test-2.1-jsps              RUNNING
[INFO] web-testsuite/test-2.1-jsps              SUCCESS (0:00:34.118) 
[INFO] web-testsuite/test-2.5-servlets          RUNNING
[INFO] web-testsuite/test-2.5-servlets          SUCCESS (0:00:26.641) 
[INFO] web-testsuite/test-jetty                 RUNNING
[INFO] web-testsuite/test-jetty                 SUCCESS (0:00:19.978) 
[INFO] web-testsuite/test-myfaces               RUNNING
[INFO] web-testsuite/test-myfaces               SUCCESS (0:00:31.222) 
[INFO] web-testsuite/test-web-forward           RUNNING
[INFO] web-testsuite/test-web-forward           SUCCESS (0:00:31.400) 
[INFO] web-testsuite/test-web-references        RUNNING
[INFO] web-testsuite/test-web-references        SUCCESS (0:00:36.628) 
[INFO] webservices-testsuite/jaxb-tests         RUNNING
[INFO] webservices-testsuite/jaxb-tests         SUCCESS (0:00:49.081) 
[INFO] webservices-testsuite/jaxr-tests         RUNNING
[INFO] webservices-testsuite/jaxr-tests         SUCCESS (0:00:47.822) 
[INFO] webservices-testsuite/jaxrpc-jaxws-tests RUNNING
[INFO] webservices-testsuite/jaxrpc-jaxws-tests SUCCESS (0:00:27.995) 
[INFO] webservices-testsuite/jaxrpc-tests       RUNNING
[INFO] webservices-testsuite/jaxrpc-tests       SUCCESS (0:00:36.286) 
[INFO] webservices-testsuite/jaxws-tests        RUNNING
[INFO] webservices-testsuite/jaxws-tests        SUCCESS (0:01:07.723) 
[INFO] webservices-testsuite/saaj-tests         RUNNING
[INFO] webservices-testsuite/saaj-tests         SUCCESS (0:00:36.760) 
[INFO] webservices-testsuite/stax-tests         RUNNING
[INFO] webservices-testsuite/stax-tests         SUCCESS (0:00:48.825) 
[INFO] 
[INFO] -------------------------------------------------------------------------------
[INFO] Test Summary (0:22:04.546)
[INFO]     Passed: 26
[INFO]     Failed: 1
[INFO] -------------------------------------------------------------------------------
[INFO] 
[INFO] The following tests failed:
[INFO]     * console-testsuite/advanced - /home/geronimo/geronimo/trunk/testsuite/console-testsuite/advanced/build.log
[INFO] 
[INFO] ------------------------------------------------------------------------
[ERROR] BUILD ERROR
 
Samples: trunk
=================================
Log: http://people.apache.org/builds/geronimo/server/binaries/trunk/20080521/samples-2100.log
 
Build status: FAILED
 

Mime
View raw message