geronimo-dev mailing list archives

Site index · List index
Message view « Date » · « Thread »
Top « Date » · « Thread »
From ga...@apache.org
Subject [BUILD] branches/2.1: Failed for Revision: 658634
Date Wed, 21 May 2008 18:43:52 GMT
Geronimo Revision: 658634 built with tests included
 
See the full build-0800.log file at http://people.apache.org/builds/geronimo/server/binaries/2.1/20080521/build-0800.log
 
Download the binaries from http://people.apache.org/builds/geronimo/server/binaries/2.1/20080521
[INFO] BUILD SUCCESSFUL
[INFO] ------------------------------------------------------------------------
[INFO] Total time: 32 minutes 38 seconds
[INFO] Finished at: Wed May 21 08:37:14 EDT 2008
[INFO] Final Memory: 303M/1010M
[INFO] ------------------------------------------------------------------------
 
TESTSUITE RESULTS (Failures only)
=================================
See detailed results at http://people.apache.org/builds/geronimo/server/testsuite/ResultsSummary.html
 
Assembly: tomcat
=================================
See the full test.log file at http://people.apache.org/builds/geronimo/server/binaries/2.1/20080521/logs-0800-tomcat/test.log
 
 
Assembly: jetty
=================================
See the full test.log file at http://people.apache.org/builds/geronimo/server/binaries/2.1/20080521/logs-0800-jetty/test.log
 
[INFO] Running console-testsuite.advance-test
[INFO] Tests run: 13, Failures: 1, Errors: 0, Skipped: 0, Time elapsed: 77.036 sec <<<
FAILURE!
--
[INFO] Running org.apache.geronimo.testsuite.testset.JaxWSTest
[INFO] Tests run: 7, Failures: 7, Errors: 0, Skipped: 0, Time elapsed: 0.418 sec <<<
FAILURE!
--
[INFO] Running org.apache.geronimo.testsuite.testset.ClientJAXWSTest
[INFO] Tests run: 1, Failures: 1, Errors: 0, Skipped: 0, Time elapsed: 0.156 sec <<<
FAILURE!
 
Samples: branches/2.1
=================================
Log: http://people.apache.org/builds/geronimo/server/binaries/2.1/20080521/samples-0800.log
 
Build status: FAILED
 

Mime
View raw message