geronimo-dev mailing list archives

Site index · List index
Message view « Date » · « Thread »
Top « Date » · « Thread »
From ga...@apache.org
Subject [BUILD] trunk: Failed for Revision: 656645
Date Thu, 15 May 2008 14:33:53 GMT
Geronimo Revision: 656645 built with tests included
 
See the full build-0900.log file at http://people.apache.org/builds/geronimo/server/binaries/trunk/20080515/build-0900.log
 
Download the binaries from http://people.apache.org/builds/geronimo/server/binaries/trunk/20080515
[INFO] BUILD SUCCESSFUL
[INFO] ------------------------------------------------------------------------
[INFO] Total time: 33 minutes 27 seconds
[INFO] Finished at: Thu May 15 09:35:29 EDT 2008
[INFO] Final Memory: 352M/1007M
[INFO] ------------------------------------------------------------------------
 
TESTSUITE RESULTS (Failures only)
=================================
See detailed results at http://people.apache.org/builds/geronimo/server/testsuite/ResultsSummary.html
 
Assembly: tomcat
=================================
See the full test.log file at http://people.apache.org/builds/geronimo/server/binaries/trunk/20080515/logs-0900-tomcat/test.log
 
 
[INFO] [selenium:start-server {execution: start}]
Launching Selenium Server
Waiting for Selenium Server...
[INFO] Including display properties from: /home/geronimo/geronimo/trunk/testsuite/target/selenium/display.properties
[INFO] Redirecting output to: /home/geronimo/geronimo/trunk/testsuite/target/selenium/server.log
[INFO] User extensions: /home/geronimo/geronimo/trunk/testsuite/target/selenium/user-extensions.js
Selenium Server started
Downloading: http://download.java.net/maven/1//woodstox/poms/wstx-asl-3.2.1.pom
Downloading: http://people.apache.org/repo/m2-incubating-repository//woodstox/wstx-asl/3.2.1/wstx-asl-3.2.1.pom
Downloading: http://repo1.maven.org/maven2/woodstox/wstx-asl/3.2.1/wstx-asl-3.2.1.pom
Downloading: http://download.java.net/maven/1//woodstox/poms/wstx-asl-3.2.1.pom
Downloading: http://people.apache.org/repo/m2-incubating-repository//woodstox/wstx-asl/3.2.1/wstx-asl-3.2.1.pom
Downloading: http://repo1.maven.org/maven2/woodstox/wstx-asl/3.2.1/wstx-asl-3.2.1.pom
[INFO] [geronimo:start-server {execution: start}]
[INFO] Using assembly configuration: tomcat
[INFO] snapshot org.apache.geronimo.assemblies:geronimo-tomcat6-javaee5:2.2-SNAPSHOT: checking
for updates from apache-snapshots
[INFO] snapshot org.apache.geronimo.assemblies:geronimo-tomcat6-javaee5:2.2-SNAPSHOT: checking
for updates from codehaus-snapshots
[INFO] snapshot org.apache.geronimo.assemblies:geronimo-tomcat6-javaee5:2.2-SNAPSHOT: checking
for updates from apache.snapshots
[INFO] Using assembly artifact: org.apache.geronimo.assemblies:geronimo-tomcat6-javaee5:zip:bin:2.2-SNAPSHOT:provided
[INFO] Using geronimoHome: /home/geronimo/geronimo/trunk/testsuite/target/geronimo-tomcat6-javaee5-2.2-SNAPSHOT
[INFO] Installing assembly...
[INFO] Expanding: /home/geronimo/.m2/repository/org/apache/geronimo/assemblies/geronimo-tomcat6-javaee5/2.2-SNAPSHOT/geronimo-tomcat6-javaee5-2.2-SNAPSHOT-bin.zip
into /home/geronimo/geronimo/trunk/testsuite/target
[INFO] Starting Geronimo server...
[INFO] Selected option set: default
[INFO] Redirecting output to: /home/geronimo/geronimo/trunk/testsuite/target/geronimo-logs/org.apache.geronimo.mavenplugins.geronimo.server.StartServerMojo.log
[INFO] Waiting for Geronimo server...
[INFO] Geronimo server started in 0:00:36.603
[INFO] [shitty:install {execution: default}]
[INFO] Installing /home/geronimo/geronimo/trunk/testsuite/pom.xml to /home/geronimo/.m2/repository/org/apache/geronimo/testsuite/testsuite/2.2-SNAPSHOT/testsuite-2.2-SNAPSHOT.pom
[INFO] [shitty:test {execution: default}]
[INFO] Starting 27 test build(s)
[INFO] 
[INFO] -------------------------------------------------------------------------------
[INFO] 
[INFO] console-testsuite/advanced               RUNNING
[INFO] console-testsuite/advanced               SUCCESS (0:01:35.710) 
[INFO] console-testsuite/basic                  RUNNING
[INFO] console-testsuite/basic                  SUCCESS (0:01:39.563) 
[INFO] corba-testsuite/corba-helloworld         RUNNING
[INFO] corba-testsuite/corba-helloworld         FAILURE (0:00:30.091) Java returned: 1
[INFO] corba-testsuite/corba-marshal            RUNNING
[INFO] corba-testsuite/corba-marshal            SUCCESS (0:01:02.778) 
[INFO] corba-testsuite/corba-mytime             RUNNING
[INFO] corba-testsuite/corba-mytime             FAILURE (0:00:29.945) Java returned: 1
[INFO] deployment-testsuite/deployment-tests    RUNNING
[INFO] deployment-testsuite/deployment-tests    SUCCESS (0:00:30.220) 
[INFO] deployment-testsuite/jca-cms-tests       RUNNING
[INFO] deployment-testsuite/jca-cms-tests       SUCCESS (0:00:28.511) 
[INFO] deployment-testsuite/manifestcp-tests    RUNNING
[INFO] deployment-testsuite/manifestcp-tests    SUCCESS (0:00:28.181) 
[INFO] enterprise-testsuite/ejb-tests           RUNNING
[INFO] enterprise-testsuite/ejb-tests           SUCCESS (0:00:36.667) 
[INFO] enterprise-testsuite/jms-tests           RUNNING
[INFO] enterprise-testsuite/jms-tests           SUCCESS (0:00:43.731) 
[INFO] enterprise-testsuite/jpa-tests           RUNNING
[INFO] enterprise-testsuite/jpa-tests           SUCCESS (0:00:38.085) 
[INFO] enterprise-testsuite/sec-client          RUNNING
[INFO] enterprise-testsuite/sec-client          SUCCESS (0:00:26.440) 
[INFO] enterprise-testsuite/sec-tests           RUNNING
[INFO] enterprise-testsuite/sec-tests           SUCCESS (0:00:38.210) 
[INFO] security-testsuite/test-security         RUNNING
[INFO] security-testsuite/test-security         SUCCESS (0:00:37.686) 
[INFO] web-testsuite/test-2.1-jsps              RUNNING
[INFO] web-testsuite/test-2.1-jsps              SUCCESS (0:00:33.173) 
[INFO] web-testsuite/test-2.5-servlets          RUNNING
[INFO] web-testsuite/test-2.5-servlets          SUCCESS (0:00:25.191) 
[INFO] web-testsuite/test-myfaces               RUNNING
[INFO] web-testsuite/test-myfaces               SUCCESS (0:00:31.126) 
[INFO] web-testsuite/test-tomcat                RUNNING
[INFO] web-testsuite/test-tomcat                SUCCESS (0:00:19.266) 
[INFO] web-testsuite/test-web-forward           RUNNING
[INFO] web-testsuite/test-web-forward           SUCCESS (0:00:30.735) 
[INFO] web-testsuite/test-web-references        RUNNING
[INFO] web-testsuite/test-web-references        SUCCESS (0:00:35.057) 
[INFO] webservices-testsuite/jaxb-tests         RUNNING
[INFO] webservices-testsuite/jaxb-tests         SUCCESS (0:00:47.486) 
[INFO] webservices-testsuite/jaxr-tests         RUNNING
[INFO] webservices-testsuite/jaxr-tests         SUCCESS (0:00:45.763) 
[INFO] webservices-testsuite/jaxrpc-jaxws-tests RUNNING
[INFO] webservices-testsuite/jaxrpc-jaxws-tests SUCCESS (0:00:30.502) 
[INFO] webservices-testsuite/jaxrpc-tests       RUNNING
[INFO] webservices-testsuite/jaxrpc-tests       SUCCESS (0:00:35.276) 
[INFO] webservices-testsuite/jaxws-tests        RUNNING
[INFO] webservices-testsuite/jaxws-tests        SUCCESS (0:01:10.108) 
[INFO] webservices-testsuite/saaj-tests         RUNNING
[INFO] webservices-testsuite/saaj-tests         SUCCESS (0:00:35.000) 
[INFO] webservices-testsuite/stax-tests         RUNNING
[INFO] webservices-testsuite/stax-tests         SUCCESS (0:00:48.049) 
[INFO] 
[INFO] -------------------------------------------------------------------------------
[INFO] Test Summary (0:18:32.724)
[INFO]     Passed: 25
[INFO]     Failed: 2
[INFO] -------------------------------------------------------------------------------
[INFO] 
[INFO] The following tests failed:
[INFO]     * corba-testsuite/corba-helloworld - /home/geronimo/geronimo/trunk/testsuite/corba-testsuite/corba-helloworld/build.log
[INFO]     * corba-testsuite/corba-mytime - /home/geronimo/geronimo/trunk/testsuite/corba-testsuite/corba-mytime/build.log
[INFO] 
[INFO] ------------------------------------------------------------------------
[ERROR] BUILD ERROR
 
Assembly: jetty
=================================
See the full test.log file at http://people.apache.org/builds/geronimo/server/binaries/trunk/20080515/logs-0900-jetty/test.log
 
 
[INFO] [selenium:start-server {execution: start}]
Launching Selenium Server
Waiting for Selenium Server...
[INFO] Including display properties from: /home/geronimo/geronimo/trunk/testsuite/target/selenium/display.properties
[INFO] Redirecting output to: /home/geronimo/geronimo/trunk/testsuite/target/selenium/server.log
[INFO] User extensions: /home/geronimo/geronimo/trunk/testsuite/target/selenium/user-extensions.js
Selenium Server started
Downloading: http://download.java.net/maven/1//woodstox/poms/wstx-asl-3.2.1.pom
Downloading: http://people.apache.org/repo/m2-incubating-repository//woodstox/wstx-asl/3.2.1/wstx-asl-3.2.1.pom
Downloading: http://repo1.maven.org/maven2/woodstox/wstx-asl/3.2.1/wstx-asl-3.2.1.pom
Downloading: http://download.java.net/maven/1//woodstox/poms/wstx-asl-3.2.1.pom
Downloading: http://people.apache.org/repo/m2-incubating-repository//woodstox/wstx-asl/3.2.1/wstx-asl-3.2.1.pom
Downloading: http://repo1.maven.org/maven2/woodstox/wstx-asl/3.2.1/wstx-asl-3.2.1.pom
[INFO] [geronimo:start-server {execution: start}]
[INFO] Using assembly configuration: jetty
[INFO] snapshot org.apache.geronimo.assemblies:geronimo-jetty6-javaee5:2.2-SNAPSHOT: checking
for updates from apache-snapshots
[INFO] snapshot org.apache.geronimo.assemblies:geronimo-jetty6-javaee5:2.2-SNAPSHOT: checking
for updates from codehaus-snapshots
[INFO] snapshot org.apache.geronimo.assemblies:geronimo-jetty6-javaee5:2.2-SNAPSHOT: checking
for updates from apache.snapshots
[INFO] Using assembly artifact: org.apache.geronimo.assemblies:geronimo-jetty6-javaee5:zip:bin:2.2-SNAPSHOT:provided
[INFO] Using geronimoHome: /home/geronimo/geronimo/trunk/testsuite/target/geronimo-jetty6-javaee5-2.2-SNAPSHOT
[INFO] Installing assembly...
[INFO] Expanding: /home/geronimo/.m2/repository/org/apache/geronimo/assemblies/geronimo-jetty6-javaee5/2.2-SNAPSHOT/geronimo-jetty6-javaee5-2.2-SNAPSHOT-bin.zip
into /home/geronimo/geronimo/trunk/testsuite/target
[INFO] Starting Geronimo server...
[INFO] Selected option set: default
[INFO] Redirecting output to: /home/geronimo/geronimo/trunk/testsuite/target/geronimo-logs/org.apache.geronimo.mavenplugins.geronimo.server.StartServerMojo.log
[INFO] Waiting for Geronimo server...
[INFO] Geronimo server started in 0:00:38.513
[INFO] [shitty:install {execution: default}]
[INFO] Installing /home/geronimo/geronimo/trunk/testsuite/pom.xml to /home/geronimo/.m2/repository/org/apache/geronimo/testsuite/testsuite/2.2-SNAPSHOT/testsuite-2.2-SNAPSHOT.pom
[INFO] [shitty:test {execution: default}]
[INFO] Starting 27 test build(s)
[INFO] 
[INFO] -------------------------------------------------------------------------------
[INFO] 
[INFO] console-testsuite/advanced               RUNNING
[INFO] console-testsuite/advanced               SUCCESS (0:01:35.504) 
[INFO] console-testsuite/basic                  RUNNING
[INFO] console-testsuite/basic                  SUCCESS (0:01:44.379) 
[INFO] corba-testsuite/corba-helloworld         RUNNING
[INFO] corba-testsuite/corba-helloworld         FAILURE (0:00:30.080) Java returned: 1
[INFO] corba-testsuite/corba-marshal            RUNNING
[INFO] corba-testsuite/corba-marshal            SUCCESS (0:01:13.174) 
[INFO] corba-testsuite/corba-mytime             RUNNING
[INFO] corba-testsuite/corba-mytime             FAILURE (0:00:30.069) Java returned: 1
[INFO] deployment-testsuite/deployment-tests    RUNNING
[INFO] deployment-testsuite/deployment-tests    SUCCESS (0:00:31.772) 
[INFO] deployment-testsuite/jca-cms-tests       RUNNING
[INFO] deployment-testsuite/jca-cms-tests       SUCCESS (0:00:28.422) 
[INFO] deployment-testsuite/manifestcp-tests    RUNNING
[INFO] deployment-testsuite/manifestcp-tests    SUCCESS (0:00:28.600) 
[INFO] enterprise-testsuite/ejb-tests           RUNNING
[INFO] enterprise-testsuite/ejb-tests           SUCCESS (0:00:32.476) 
[INFO] enterprise-testsuite/jms-tests           RUNNING
[INFO] enterprise-testsuite/jms-tests           SUCCESS (0:00:44.103) 
[INFO] enterprise-testsuite/jpa-tests           RUNNING
[INFO] enterprise-testsuite/jpa-tests           SUCCESS (0:00:38.147) 
[INFO] enterprise-testsuite/sec-client          RUNNING
[INFO] enterprise-testsuite/sec-client          SUCCESS (0:00:27.293) 
[INFO] enterprise-testsuite/sec-tests           RUNNING
[INFO] enterprise-testsuite/sec-tests           SUCCESS (0:00:39.480) 
[INFO] security-testsuite/test-security         RUNNING
[INFO] security-testsuite/test-security         SUCCESS (0:00:37.937) 
[INFO] web-testsuite/test-2.1-jsps              RUNNING
[INFO] web-testsuite/test-2.1-jsps              SUCCESS (0:00:33.931) 
[INFO] web-testsuite/test-2.5-servlets          RUNNING
[INFO] web-testsuite/test-2.5-servlets          SUCCESS (0:00:25.898) 
[INFO] web-testsuite/test-jetty                 RUNNING
[INFO] web-testsuite/test-jetty                 SUCCESS (0:00:20.487) 
[INFO] web-testsuite/test-myfaces               RUNNING
[INFO] web-testsuite/test-myfaces               SUCCESS (0:00:32.467) 
[INFO] web-testsuite/test-web-forward           RUNNING
[INFO] web-testsuite/test-web-forward           SUCCESS (0:00:30.977) 
[INFO] web-testsuite/test-web-references        RUNNING
[INFO] web-testsuite/test-web-references        SUCCESS (0:00:35.737) 
[INFO] webservices-testsuite/jaxb-tests         RUNNING
[INFO] webservices-testsuite/jaxb-tests         SUCCESS (0:00:49.823) 
[INFO] webservices-testsuite/jaxr-tests         RUNNING
[INFO] webservices-testsuite/jaxr-tests         SUCCESS (0:00:48.881) 
[INFO] webservices-testsuite/jaxrpc-jaxws-tests RUNNING
[INFO] webservices-testsuite/jaxrpc-jaxws-tests SUCCESS (0:00:28.048) 
[INFO] webservices-testsuite/jaxrpc-tests       RUNNING
[INFO] webservices-testsuite/jaxrpc-tests       SUCCESS (0:00:36.266) 
[INFO] webservices-testsuite/jaxws-tests        RUNNING
[INFO] webservices-testsuite/jaxws-tests        SUCCESS (0:01:06.093) 
[INFO] webservices-testsuite/saaj-tests         RUNNING
[INFO] webservices-testsuite/saaj-tests         SUCCESS (0:00:35.402) 
[INFO] webservices-testsuite/stax-tests         RUNNING
[INFO] webservices-testsuite/stax-tests         SUCCESS (0:00:48.264) 
[INFO] 
[INFO] -------------------------------------------------------------------------------
[INFO] Test Summary (0:18:53.887)
[INFO]     Passed: 25
[INFO]     Failed: 2
[INFO] -------------------------------------------------------------------------------
[INFO] 
[INFO] The following tests failed:
[INFO]     * corba-testsuite/corba-helloworld - /home/geronimo/geronimo/trunk/testsuite/corba-testsuite/corba-helloworld/build.log
[INFO]     * corba-testsuite/corba-mytime - /home/geronimo/geronimo/trunk/testsuite/corba-testsuite/corba-mytime/build.log
[INFO] 
[INFO] ------------------------------------------------------------------------
[ERROR] BUILD ERROR
 
Samples: trunk
=================================
Log: http://people.apache.org/builds/geronimo/server/binaries/trunk/20080515/samples-0900.log
 
Build status: OK
 

Mime
View raw message